{"text_format":"1","workbook":"xlsx","n_sheets":3,"sheets":["問題1000","問題印刷","Sheet3"],"not_rendered":{"charts":0,"images":0,"macros":1,"external_links":0,"defined_names":1,"comments":0,"pivot_tables":0},"unopened":[],"bounds":{"document_bytes":16777216,"sheet_cells":100000,"rows_first":2000,"rows_last":500,"rows_between":2000,"halvings":0,"cell_chars":16384,"cell_head_chars":4096},"cells_cut":0,"cells_raw":0,"read":"whole","date_system":"1900"}

{"sheet":"問題1000","index":0,"n_rows":1338,"n_cols":4,"rows_kept":1338,"cut":false,"hidden":false,"merged":[]}
[]
[1,"P8","運動","うんどう"]
[2,"P9","相談","そうだん"]
[3,null,"正解","せいかい"]
[4,null,"名前","なまえ"]
[5,"P12","乗せる","のせる"]
[6,null,"信号","しんごう"]
[7,null,"夏みかん","なつみかん"]
[8,null,"運転手","うんてんしゅ"]
[9,"P13","暑い日","あついひ"]
[10,null,"速達",{"$f":"PHONETIC(C11)","v":"そくたつ"}]
[11,null,"送る",{"$f":"PHONETIC(C12)","v":"おくる"}]
[12,null,"大通り","おおどおり"]
[13,null,"曲がる","まがる"]
[14,null,"細い","ほそい"]
[15,"P14","車道","しゃどう"]
[16,null,"飛び出す","とびだす"]
[17,"P15","高くまい上がる","たかくまいあがる"]
[18,null,"ため息","ためいき"]
[19,null,"横を通る","よこをとおる"]
[20,null,"急いでもどる","いそいでもどる"]
[21,null,"運転席","うんてんせき"]
[22,"P16","辺りを見る","あたりをみる"]
[23,null,"見事な色","みごとないろ"]
[24,null,"四角い建物","しかくいたてもの"]
[25,null,"つかれた声","つかれたこえ"]
[26,"P17","菜の花横町","なのはなよこちょう"]
[27,null,"菜の花橋","なのはなばし"]
[28,null,"元気そう","げんきそう"]
[29,null,"遠くから","とおくから"]
[30,null,"水色","みずいろ"]
[31,"P18","客席","きゃくせき"]
[32,null,"流れる","ながれる"]
[33,null,"男の子の顔","おとこのこのかお"]
[34,"P19","ふり返る","ふりかえる"]
[35,null,"外を見る","そとをみる"]
[36,"P20","団地","だんち"]
[37,null,"野原","のはら"]
[38,null,"青々","あおあお"]
[39,null,"わた毛","わたげ"]
[40,null,"小さな声","ちいさなこえ"]
[41,"P22","印象","いんしょう"]
[42,null,"会話","かいわ"]
[43,null,"理由","りゆう"]
[44,null,"友達","ともだち"]
[45,"P24","登場人物","とうじょうじんぶつ"]
[46,null,"受ける","うける"]
[47,null,"深まる","ふかまる"]
[48,null,"地の文","じのぶん"]
[49,null,"始まる","はじまる"]
[50,"P25","場面","ばめん"]
[51,"P26","漢字","かんじ"]
[52,null,"意味","いみ"]
[53,null,"花火","はなび"]
[54,null,"開花","かいか"]
[55,null,"野菜","やさい"]
[56,null,"目薬","めぐすり"]
[57,null,"胃腸薬","いちょうやく"]
[58,null,"家路","いえじ"]
[59,null,"家庭菜園","かていさいえん"]
[60,null,"安らか","やすらか"]
[61,null,"安全安心","あんぜんあんしん"]
[62,null,"絵筆","えふで"]
[63,null,"毛筆","もうひつ"]
[64,null,"木箱","きばこ"]
[65,null,"箱庭","はこにわ"]
[66,null,"雨雲","あまぐも"]
[67,null,"雲海","うんかい"]
[68,null,"雪国","ゆきぐに"]
[69,null,"新雪","しんせつ"]
[70,"P27","悪者","わるもの"]
[71,null,"悪事","あくじ"]
[72,null,"決意","けつい"]
[73,null,"共感","きょうかん"]
[74,null,"日照り","ひでり"]
[75,null,"照明",{"$f":"PHONETIC(C76)","v":"しょうめい"}]
[76,null,"遠出","とおで"]
[77,null,"遠足","えんそく"]
[78,null,"近道","ちかみち"]
[79,null,"近景と遠景","きんけいとえんけい"]
[80,null,"熱いお湯","あついおゆ"]
[81,null,"発熱","はつねつ"]
[82,null,"通り道","とおりみち"]
[83,null,"通学路","つうがくろ"]
[84,null,"府立高校","ふりつこうこう"]
[85,null,"京都府","きょうとふ"]
[86,null,"広場","ひろば"]
[87,null,"広告","こうこく"]
[88,null,"店先","みせさき"]
[89,null,"商店街","しょうてんがい"]
[90,null,"図書室","としょしつ"]
[91,null,"図面","ずめん"]
[92,null,"田園","でんえん"]
[93,null,"公園","こうえん"]
[94,null,"島国","しまぐに"]
[95,null,"外国","がいこく"]
[96,null,"海開き","うみびらき"]
[97,null,"開始","かいし"]
[98,null,"関所","せきしょ"]
[99,null,"関係","かんけい"]
[100,null,"間近","まぢか"]
[101,null,"期間","きかん"]
[102,null,"植物","しょくぶつ"]
[103,null,"題名","だいめい"]
[104,null,"決める","きめる"]
[105,null,"図書係","としょがかり"]
[106,null,"幸い","さいわい"]
[107,null,"何度も聞く","なんどもきく"]
[108,null,"実験","じっけん"]
[109,null,"重ねる","かさねる"]
[110,null,"調子","ちょうし"]
[111,null,"整える","ととのえる"]
[112,null,"役立つ","やくだつ"]
[113,null,"時代の変化","じだいのへんか"]
[114,null,"化石","かせき"]
[115,null,"身動き","みうごき"]
[116,null,"全くない","まったくない"]
[117,null,"表通り","おもてどおり"]
[118,null,"取材","しゅざい"]
[119,null,"放送委員","ほうそういいん"]
[120,null,"旅をする","たびをする"]
[121,null,"作業時間","さぎょうじかん"]
[122,null,"病院","びょういん"]
[123,null,"合流","ごうりゅう"]
[124,null,"高速道路","こうそくどうろ"]
[125,null,"空港へ向かう","くうこうへむかう"]
[126,null,"読書感想文","どくしょかんそうぶん"]
[127,null,"洋服","ようふく"]
[128,null,"気を配る","きをくばる"]
[129,null,"白組が勝つ","しろぐみがかつ"]
[130,null,"商売の相談","しょうばいのそうだん"]
[131,"P29","漢字辞典","かんじじてん"]
[132,null,"成り立ち","なりたち"]
[133,null,"画数","かくすう"]
[134,null,"語句","ごく"]
[135,null,"音訓さくいん","おんくんさくいん"]
[136,null,"部首さくいん","ぶしゅさくいん"]
[137,null,"総画さくいん","そうかくさくいん"]
[138,null,"分類する","ぶんるいする"]
[139,null,"筆順に気をつける",{"$f":"PHONETIC(C140)","v":"ひつじゅんにきをつける"}]
[140,"P30","五十音順","ごじゅうおんじゅん"]
[141,"P31","東西南北","とうざいなんぼく"]
[142,null,"お社","おやしろ"]
[143,null,"愛読書","あいどくしょ"]
[144,null,"デヴィ夫人","デヴィふじん"]
[145,null,"昨夜","さくや"]
[146,null,"本を正す","もとをただす"]
[147,null,"青年","せいねん"]
[148,null,"灯台の近く","とうだいのちかく"]
[149,"P32","手帳","てちょう"]
[150,null,"木の芽","きのめ"]
[151,null,"若草物語","わかくさものがたり"]
[152,null,"茶畑","ちゃばたけ"]
[153,null,"茶所","ちゃどころ"]
[154,null,"新茶の季節","しんちゃのきせつ"]
[155,null,"立春","りっしゅん"]
[156,null,"立秋","りっしゅう"]
[157,"P34","司会","しかい"]
[158,null,"管理","かんり"]
[159,null,"議題","ぎだい"]
[160,null,"提案","ていあん"]
[161,null,"参加者","さんかしゃ"]
[162,null,"目的","もくてき"]
[163,null,"書記","しょき"]
[164,null,"時間配分","じかんはいぶん"]
[165,null,"学級新聞","がっきゅうしんぶん"]
[166,null,"予定どおり","よていどおり"]
[167,"P37","結果","けっか"]
[168,null,"工夫する","くふうする"]
[169,null,"明らか","あきらか"]
[170,"P38","返事","へんじ"]
[171,null,"受け止め方","うけとめかた"]
[172,"P40","筋肉","きんにく"]
[173,null,"選手","せんしゅ"]
[174,"P41","強い力","つよいちから"]
[175,null,"大切","たいせつ"]
[176,null,"同時","どうじ"]
[177,null,"説明文","せつめいぶん"]
[178,null,"深い関係","ふかいかんけい"]
[179,"P42","成功","せいこう"]
[180,null,"失敗","しっぱい"]
[181,null,"最高","さいこう"]
[182,null,"陸上","りくじょう"]
[183,null,"経験","けいけん"]
[184,null,"方法","ほうほう"]
[185,null,"楽になる","らくになる"]
[186,"P43","記録する","きろくする"]
[187,null,"必ずしも","かならずしも"]
[188,null,"苦しくなる","くるしくなる"]
[189,null,"高校生","こうこうせい"]
[190,null,"当時","とうじ"]
[191,null,"毎日","まいにち"]
[192,null,"動作","どうさ"]
[193,"P44","必要","ひつよう"]
[194,null,"無意識","むいしき"]
[195,"P45","発見","はっけん"]
[196,null,"前に進む","まえにすすむ"]
[197,null,"下り坂","くだりざか"]
[198,"P46","重要","じゅうよう"]
[199,null,"両手","りょうて"]
[200,null,"数十メートル","すうじゅうめーとる"]
[201,null,"着地","ちゃくち"]
[202,"P47","積極的","せっきょくてき"]
[203,null,"重ねる",{"$f":"PHONETIC(C204)","v":"かさねる"}]
[204,"P48","体験","たいけん"]
[205,"P49","解説","かいせつ"]
[206,null,"共感","きょうかん"]
[207,"P51","鉄橋","てっきょう"]
[208,null,"坂道","さかみち"]
[209,null,"中央区","ちゅうおうく"]
[210,null,"県立図書館","けんりつとしょかん"]
[211,null,"農家","のうか"]
[212,null,"温室","おんしつ"]
[213,null,"大安売り","おおやすうり"]
[214,null,"行列","ぎょうれつ"]
[215,null,"申しこむ","もうしこむ"]
[216,null,"市役所","しやくしょ"]
[217,null,"都市","とし"]
[218,null,"病院","びょういん"]
[219,null,"医者","いしゃ"]
[220,null,"銀行","ぎんこう"]
[221,null,"宿題","しゅくだい"]
[222,null,"住人","じゅうにん"]
[223,null,"教室","きょうしつ"]
[224,null,"胃腸薬","いちょうやく"]
[225,"P52","短歌","たんか"]
[226,null,"景色","けしき"]
[227,null,"調子","ちょうし"]
[228,"P54","新聞","しんぶん"]
[229,null,"目的","もくてき"]
[230,null,"話題","わだい"]
[231,"P55","発行者","はっこうしゃ"]
[232,null,"効果的","こうかてき"]
[233,null,"取材","しゅざい"]
[234,null,"防災","ぼうさい"]
[235,"P56","具体的","ぐたいてき"]
[236,null,"話題","わだい"]
[237,null,"災害","さいがい"]
[238,"P57","校長先生","こうちょうせんせい"]
[239,"P58","回答例","かいとうれい"]
[240,null,"予想","よそう"]
[241,"P59","下書き","したがき"]
[242,null,"文字数","もじすう"]
[243,null,"用紙","ようし"]
[244,null,"句読点","くとうてん"]
[245,null,"主語","しゅご"]
[246,"P60","位置を決める","いちをきめる"]
[247,null,"清書","せいしょ"]
[248,null,"完成","かんせい"]
[249,null,"例えばの話","たとえばのはなし"]
[250,null,"雪が積もる","ゆきがつもる"]
[251,null,"有害物質","ゆうがいぶっしつ"]
[252,null,"成果と課題","せいかとかだい"]
[253,null,"出血する","しゅっけつする"]
[254,"P64","金賞","きんしょう"]
[255,null,"昼食","ちゅうしょく"]
[256,null,"昼夜問わず","ちゅうやとわず"]
[257,"P65","目標","もくひょう"]
[258,null,"卒業式","そつぎょうしき"]
[259,null,"大漁旗","たいりょうき"]
[260,null,"民宿","みんしゅく"]
[261,null,"副大臣","ふくだいじん"]
[262,null,"参考書","さんこうしょ"]
[263,null,"梅干し","うめぼし"]
[264,null,"松竹梅","しょうちくばい"]
[265,"P66","昔話","むかしばなし"]
[266,"P68","最初","さいしょ"]
[267,null,"戦争",{"$f":"PHONETIC(C268)","v":"せんそう"}]
[268,null,"配給","はいきゅう"]
[269,null,"飛行機","ひこうき"]
[270,null,"言葉","ことば"]
[271,"P70","知らず知らず","しらずしらず"]
[272,null,"深いため息","ふかいためいき"]
[273,null,"高い高い","たかいたかい"]
[274,"P72","遠い駅","とおいえき"]
[275,null,"汽車","きしゃ"]
[276,null,"送っていく","おくっていく"]
[277,null,"防空頭巾","ぼうくうずきん"]
[278,null,"包帯","ほうたい"]
[279,null,"お薬手帳","おくすりてちょう"]
[280,"P73","駅に着く","えきにつく"]
[281,null,"泣き顔","なきがお"]
[282,null,"勇ましい","いさましい"]
[283,null,"軍歌","ぐんか"]
[284,"P74","兵隊","へいたい"]
[285,null,"一生けんめい","いっしょうけんめい"]
[286,null,"泣き出す","なきだす"]
[287,null,"食べちゃう","たべちゃう"]
[288,"P75","一輪の花","いちりんのはな"]
[289,null,"帰ってきた","かえってきた"]
[290,"P76","知らない","しらない"]
[291,null,"お肉とお魚","おにくとおさかな"]
[292,"P77","お昼","おひる"]
[293,null,"包み紙","つつみがみ"]
[294,null,"別れる","わかれる"]
[295,null,"妹が泣く","いもうとがなく"]
[296,null,"鳥が鳴く","とりがなく"]
[297,null,"意見が合う","いけんがあう"]
[298,null,"友達に会う","ともだちにあう"]
[299,null,"旅館","りょかん"]
[300,null,"結びの一番","むすびのいちばん"]
[301,null,"特別急行","とくべつきゅうこう"]
[302,null,"世界平和","せかいへいわ"]
[303,"P82","夏木立","なつこだち"]
[304,null,"夏草","なつくさ"]
[305,null,"海水浴","かいすいよく"]
[306,null,"波打ちぎわ","なみうちぎわ"]
[307,null,"日光浴","にっこうよく"]
[308,null,"海開き","うみびらき"]
[309,null,"遠泳","えんえい"]
[310,null,"打ち水","うちみず"]
[311,null,"夕すずみ","ゆうすずみ"]
[312,"P84","発表会","はっぴょうかい"]
[313,null,"活動の流れ","かつどうのながれ"]
[314,"P86","各段落","かくだんらく"]
[315,null,"気温が高い","きおんがたかい"]
[316,null,"出会う","であう"]
[317,"P89","読書","どくしょ"]
[318,null,"体育館","たいいくかん"]
[319,null,"教室","きょうしつ"]
[320,null,"整理する","せいりする"]
[321,null,"話題を変える","わだいをかえる"]
[322,null,"立場を決める","たちばをきめる"]
[323,null,"欠席の理由","けっせきのりゆう"]
[324,null,"練習","れんしゅう"]
[325,null,"大波","おおなみ"]
[326,null,"泳ぐ","およぐ"]
[327,null,"太陽光発電","たいようこうはつでん"]
[328,null,"息継ぎ","いきつぎ"]
[329,null,"家族","かぞく"]
[330,null,"荷物を持つ","にもつをもつ"]
[331,null,"九州旅行",{"$f":"PHONETIC(C332)","v":"きゅうしゅうりょこう"}]
[332,null,"有名人","ゆうめいじん"]
[333,null,"かき氷","かきごおり"]
[334,null,"夏祭り","なつまつり"]
[335,null,"命中する","めいちゅうする"]
[336,null,"鉄板","てっぱん"]
[337,null,"配る","くばる"]
[338,null,"炭火焼","すみびやき"]
[339,null,"油を引く","あぶらをひく"]
[340,null,"味わう","あじわう"]
[341,null,"自由研究","じゆうけんきゅう"]
[342,null,"調べる","しらべる"]
[343,null,"豆を育てる","まめをそだてる"]
[344,null,"温度","おんど"]
[345,null,"緑色","みどりいろ"]
[346,null,"根とくきと葉","ねとくきとは"]
[347,"P90","生活","せいかつ"]
[348,null,"周りの人","まわりのひと"]
[349,"P92","事件","じけん"]
[350,null,"出来事","できごと"]
[351,null,"種類","しゅるい"]
[352,null,"季節","きせつ"]
[353,null,"夕日","ゆうひ"]
[354,null,"見上げる","みあげる"]
[355,null,"設定","せってい"]
[356,"P94","クモの巣","くものす"]
[357,null,"木もれ日","こもれび"]
[358,null,"いい気分","いいきぶん"]
[359,null,"遊んでいる","あそんでいる"]
[360,null,"地面","じめん"]
[361,null,"休息","きゅうそく"]
[362,null,"歯をむき出す","はをむきだす"]
[363,null,"相手をする","あいてをする"]
[364,"P97","無理","むり"]
[365,null,"首すじ","くびすじ"]
[366,null,"後ずさり","あとずさり"]
[367,"P98","走り去る","はしりさる"]
[368,null,"今度","こんど"]
[369,"P99","感動","かんどう"]
[370,null,"筆者","ひっしゃ"]
[371,"P100","結末","けつまつ"]
[372,null,"自然","しぜん"]
[373,"P101","図書館","としょかん"]
[374,null,"表紙","ひょうし"]
[375,null,"目次","もくじ"]
[376,null,"司書","ししょ"]
[377,null,"児童書","じどうしょ"]
[378,"P102","入道雲","にゅうどうぐも"]
[379,null,"素晴らしい","すばらしい"]
[380,null,"夕立","ゆうだち"]
[381,null,"木々の葉","きぎのは"]
[382,null,"波の音","なみのおと"]
[383,null,"忘れ物","わすれもの"]
[384,"P104","真っ赤な月","まっかなつき"]
[385,null,"雲のかげ","くものかげ"]
[386,"P106","漢字","かんじ"]
[387,null,"気候","きこう"]
[388,null,"工事","こうじ"]
[389,null,"時期","じき"]
[390,null,"器官","きかん"]
[391,null,"英語","えいご"]
[392,"P107","絵画","かいが"]
[393,null,"午前","ごぜん"]
[394,null,"全体","ぜんたい"]
[395,null,"航海",{"$f":"PHONETIC(C396)","v":"こうかい"}]
[396,null,"表記","ひょうき"]
[397,null,"希望","きぼう"]
[398,null,"力士","りきし"]
[399,null,"葉脈","ようみゃく"]
[400,null,"直径","ちょっけい"]
[401,null,"半径","はんけい"]
[402,null,"計算","けいさん"]
[403,null,"参加","さんか"]
[404,null,"夏期","かき"]
[405,null,"紀行文","きこうぶん"]
[406,null,"合体","がったい"]
[407,null,"太陽系","たいようけい"]
[408,null,"用紙","ようし"]
[409,null,"一兆円","いっちょうえん"]
[410,null,"遠足","えんそく"]
[411,null,"速度","そくど"]
[412,null,"土台","どだい"]
[413,null,"神社","じんじゃ"]
[414,null,"弓矢","ゆみや"]
[415,null,"野菜","やさい"]
[416,null,"校歌","こうか"]
[417,null,"家屋","かおく"]
[418,null,"億万長者","おくまんちょうじゃ"]
[419,null,"無事","ぶじ"]
[420,null,"森林","しんりん"]
[421,"P108","関わり合う","かかわりあう"]
[422,null,"資料","しりょう"]
[423,null,"組み立て","くみたて"]
[424,null,"記録","きろく"]
[425,"P109","表面","ひょうめん"]
[426,null,"不自由","ふじゆう"]
[427,null,"課題","かだい"]
[428,null,"ゆうびん局","ゆうびんきょく"]
[429,null,"放送局","ほうそうきょく"]
[430,null,"消防局","しょうぼうきょく"]
[431,null,"水道局","すいどうきょく"]
[432,null,"点字","てんじ"]
[433,null,"市役所","しやくしょ"]
[434,"P110","入院","にゅういん"]
[435,null,"通う","かよう"]
[436,null,"親しむ","したしむ"]
[437,null,"北原白秋","きたはらはくしゅう"]
[438,null,"思い出","おもいで"]
[439,null,"病室","びょうしつ"]
[440,"P111","指先","ゆびさき"]
[441,null,"読み取る","よみとる"]
[442,null,"感じる","かんじる"]
[443,"P112","空白","くうはく"]
[444,null,"知識","ちしき"]
[445,null,"便利","べんり"]
[446,null,"音符","おんぷ"]
[447,null,"心を結ぶ","こころをむすぶ"]
[448,null,"道具","どうぐ"]
[449,null,"数字","すうじ"]
[450,"P114","立体","りったい"]
[451,"P115","録音","ろくおん"]
[452,null,"考案","こうあん"]
[453,null,"生まれる","うまれる"]
[454,"P116","要点","ようてん"]
[455,null,"短い言葉","みじかいことば"]
[456,"P117","案内地図","あんないちず"]
[457,null,"歩道","ほどう"]
[458,null,"命に関わる","いのちにかかわる"]
[459,null,"お礼",{"$f":"PHONETIC(C460)","v":"おれい"}]
[460,null,"参考資料","さんこうしりょう"]
[461,"P118","電話機","でんわき"]
[462,null,"身近なところ","みぢかなところ"]
[463,null,"公共","こうきょう"]
[464,null,"道路","どうろ"]
[465,null,"今後","こんご"]
[466,"P120","落とす","おとす"]
[467,null,"始まり","はじまり"]
[468,null,"急いで追う","いそいでおう"]
[469,null,"暗い夜","くらいよる"]
[470,null,"深い穴","ふかいあな"]
[471,null,"酒を飲む","さけをのむ"]
[472,null,"皿を割る","さらをわる"]
[473,null,"幸福になる","こうふくになる"]
[474,null,"悪い子","わるいこ"]
[475,null,"海岸で悲しむ","かいがんでかなしむ"]
[476,null,"助けを呼ぶ","たすけをよぶ"]
[477,null,"現場を去る","げんばをさる"]
[478,null,"現場に向かう","げんばにむかう"]
[479,null,"車に乗る","くるまにのる"]
[480,null,"会場に着く","かいじょうにつく"]
[481,null,"美しい女性","うつくしいじょせい"]
[482,null,"玉手箱","たまてばこ"]
[483,null,"受け取る","うけとる"]
[484,null,"空けたら終わり","あけたらおわり"]
[485,null,"先頭打者","せんとうだしゃ"]
[486,null,"配線","はいせん"]
[487,null,"日高山脈","ひだかさんみゃく"]
[488,null,"札幌市","さっぽろし"]
[489,null,"算数","さんすう"]
[490,null,"百ます計算","ひゃくますけいさん"]
[491,null,"大谷先生","おおたにせんせい"]
[492,null,"三角形","さんかくけい"]
[493,null,"周囲の反対","しゅういのはんたい"]
[494,null,"お参りをする","おまいりをする"]
[495,null,"役目を果たす","やくめをはたす"]
[496,null,"心配性","しんぱいしょう"]
[497,null,"熱いお湯","あついおゆ"]
[498,null,"焼肉","やきにく"]
[499,null,"薬を買う","くすりをかう"]
[500,"P8","変化","へんか"]
[501,null,"村の近く","むらのちかく"]
[502,null,"おとの様","おとのさま"]
[503,null,"住んでいる","すんせいる"]
[504,null,"少し","すこし"]
[505,null,"夜でも昼でも","よるでもひるでも"]
[506,null,"辺りの村","あたりのむら"]
[507,null,"ほり散らす","ほりちらす"]
[508,null,"菜種油","なたねあぶら"]
[509,"P9","むしり取る","むしりとる"]
[510,null,"雨が続く","あめがつづく"]
[511,null,"外へ出る","そとへでる"]
[512,null,"晴れる","はれる"]
[513,null,"もずの声","もずのこえ"]
[514,null,"光る","ひかる"]
[515,null,"三日","みっか"]
[516,"P10","黄色","きいろ"]
[517,null,"横だおし","よこだおし"]
[518,null,"川下","かわしも"]
[519,null,"深い所","ふかいところ"]
[520,null,"思う","おもう"]
[521,null,"黒い着物","くろいきもの"]
[522,null,"魚をとる","さかなをとる"]
[523,null,"横顔","よこがお"]
[524,null,"円い葉","まるいは"]
[525,null,"丸いボール","まるいボール"]
[526,"P11","へばり付く","へばりつく"]
[527,null,"前と後ろ","まえとうしろ"]
[528,null,"持ち上げる","もちあげる"]
[529,null,"しばの根","しばのね"]
[530,null,"草の葉","くさのは"]
[531,null,"木切れ","きぎれ"]
[532,null,"太いうなぎ","ふというなぎ"]
[533,"P12","土手に置く","どてにおく"]
[534,null,"川上","かわかみ"]
[535,null,"飛び出す","とびだす"]
[536,null,"上手と下手","かみてとしもて"]
[537,null,"上手と下手","じょうずとへた"]
[538,null,"音を立てる","おとをたてる"]
[539,null,"顔にはり付く","かおにはりつく"]
[540,null,"横っ飛び","よこっとび"]
[541,"P13","ふり返る","ふりかえる"]
[542,null,"十日ほど","とおかほど"]
[543,null,"家内","かない"]
[544,null,"お歯黒","おはぐろ"]
[545,null,"秋祭り","あきまつり"]
[546,null,"笛の音","ふえのおと"]
[547,"P14","お宮","おみや"]
[548,null,"考える","かんがえる"]
[549,null,"家の中","いえのなか"]
[550,null,"死んだ","しんだ"]
[551,"P15","合図","あいず"]
[552,null,"見え始める","みえはじめる"]
[553,null,"人々","ひとびと"]
[554,null,"ふみ折る","ふみおる"]
[555,"P16","元気","げんき"]
[556,null,"今日","きょう"]
[557,null,"食べたい","たべたい"]
[558,"P17","物置","ものおき"]
[559,null,"安売り","やすうり"]
[560,null,"かごを積む","かごをつむ"]
[561,null,"両手","りょうて"]
[562,"P18","坂の上","さかのうえ"]
[563,null,"麦をとぐ","むぎをとぐ"]
[564,null,"昼飯","ひるめし"]
[565,null,"拾う","ひろう"]
[566,null,"変なこと","へんなこと"]
[567,null,"いわし屋","いわしや"]
[568,"P19","細い道","ほそいみち"]
[569,null,"松たけ","まつたけ"]
[570,null,"道のかた側","みちのかたがわ"]
[571,"P20","知らない","しらない"]
[572,null,"不思議","ふしぎ"]
[573,null,"毎日走る","まいにちはしる"]
[574,"P21","気がつかない","きがつかない"]
[575,null,"木魚","もくぎょ"]
[576,null,"明かりが差す","あかりがさす"]
[577,null,"ぼうず頭","ぼうずあたま"]
[578,null,"動く","うごく"]
[579,"P22","お念仏","おねんぶつ"]
[580,null,"連れ立つ","つれだつ"]
[581,"P23","神様","かみさま"]
[582,null,"顔を見る","かおをみる"]
[583,null,"お礼を言う","おれいをいう"]
[584,null,"明くる日","あくるひ"]
[585,"P24","火薬","かやく"]
[586,null,"足音","あしおと"]
[587,null,"戸口","とぐち"]
[588,null,"土間","どま"]
[589,null,"固めて置く","かためておく"]
[590,"P25","取り落とす","とりおとす"]
[591,null,"細く出る","ほそくでる"]
[592,null,"変身","へんしん"]
[593,null,"記念","きねん"]
[594,null,"美しい","うつくしい"]
[595,null,"海岸","かいがん"]
[596,null,"たどり着く","たどりつく"]
[597,null,"助けて","たすけて"]
[598,null,"よい天候","よいてんこう"]
[599,null,"楽器","がっき"]
[600,null,"消化器官","しょうかきかん"]
[601,null,"英語を読む","えいごをよむ"]
[602,null,"船が欠航","ふねがけっこう"]
[603,null,"投票結果","とうひょうけっか"]
[604,null,"希望の光","きぼうのひかり"]
[605,null,"展望台","てんぼうだい"]
[606,null,"消防士","しょうぼうし"]
[607,null,"山脈","さんみゃく"]
[608,null,"円の半径","えんのはんけい"]
[609,null,"紀行文","きこうぶん"]
[610,null,"住所と氏名","じゅうしょとしめい"]
[611,null,"三兆円","さんちょうえん"]
[612,null,"一億人","いちおくにん"]
[613,null,"幸せを望む","しあわせをのぞむ"]
[614,null,"外国の料理","がいこくのりょうり"]
[615,null,"重大な課題","じゅうだいなかだい"]
[616,null,"不安になる","ふあんになる"]
[617,null,"機械化","きかいか"]
[618,null,"便利","べんり"]
[619,null,"辞書","じしょ"]
[620,null,"お札","おさつ"]
[621,null,"お便り","おたより"]
[622,null,"名札","なふだ"]
[623,null,"変化","へんか"]
[624,null,"まき散らす","まきちらす"]
[625,null,"続く","つづく"]
[626,null,"よごれが付く","よごれが付く"]
[627,null,"紙を折る","かみをおる"]
[628,null,"朝飯前","あさめしまえ"]
[629,null,"松の木","まつのき"]
[630,null,"左側","ひだりがわ"]
[631,null,"念を入れる","ねんをいれる"]
[632,null,"変わる","かわる"]
[633,null,"お散歩","おさんぽ"]
[634,null,"続行","ぞっこう"]
[635,null,"家の付近","いえのふきん"]
[636,null,"骨折","こっせつ"]
[637,null,"昼ご飯","ひるごはん"]
[638,null,"松竹梅","しょうちくばい"]
[639,null,"側面","そくめん"]
[640,null,"交差点","こうさてん"]
[641,null,"三連休","さんれんきゅう"]
[642,null,"固定する","こていする"]
[643,null,"十人十色","じゅうにんといろ"]
[644,"P27","着目","ちゃくもく"]
[645,"P30","風景","ふうけい"]
[646,"P32","意味","いみ"]
[647,null,"決まり文句","きまりもんく"]
[648,null,"借りてくる","かりてくる"]
[649,null,"国語辞典","こくごじてん"]
[650,"P33","孫の声","まごのこえ"]
[651,null,"号令","ごうれい"]
[652,null,"貯金","ちょきん"]
[653,null,"老母","ろうぼ"]
[654,null,"息を殺す","いきをころす"]
[655,null,"血液型","けつえきがた"]
[656,null,"肉を焼く","にくをやく"]
[657,null,"お姉さん","おねえさん"]
[658,"P34","関係","かんけい"]
[659,null,"説明","せつめい"]
[660,null,"工夫","くふう"]
[661,null,"画面","がめん"]
[662,null,"開始","かいし"]
[663,"P35","待ち受ける","まちうける"]
[664,null,"伝える","つたえる"]
[665,null,"中央","ちゅうおう"]
[666,null,"初めの様子","初めの様子"]
[667,null,"静かに待つ","しずかにまつ"]
[668,"P36","直後","ちょくご"]
[669,null,"喜び","よろこび"]
[670,null,"おうえん席","おうえんせき"]
[671,null,"選手以外","せんしゅいがい"]
[672,null,"細かい","こまかい"]
[673,"P37","試合直後","しあいちょくご"]
[674,null,"旗をふる","はたをふる"]
[675,null,"勝った","かった"]
[676,null,"立ち上がる","たちあがる"]
[677,null,"勝利","しょうり"]
[678,null,"顔つき","かおつき"]
[679,null,"各選手","かくせんしゅ"]
[680,null,"気持ち","きもち"]
[681,null,"分かる","わかる"]
[682,"P38","用意する","よういする"]
[683,null,"放送","ほうそう"]
[684,null,"新聞","しんぶん"]
[685,null,"目的","もくてき"]
[686,null,"写真","しゃしん"]
[687,null,"組み合わせ","くみあわせ"]
[688,null,"紙面","しめん"]
[689,null,"取材","しゅざい"]
[690,null,"角度","かくど"]
[691,"P39","受け手","うけて"]
[692,null,"送り手","おくりて"]
[693,null,"決める","きめる"]
[694,"P40","筆者","ひっしゃ"]
[695,null,"対比","たいひ"]
[696,"P41","着目","ちゃくもく"]
[697,null,"印刷物","いんさつぶつ"]
[698,null,"番組","ばんぐみ"]
[699,"P42","都道府県","とどうふけん"]
[700,null,"市町村","しちょうそん"]
[701,null,"郡部","ぐんぶ"]
[702,null,"直角","ちょっかく"]
[703,null,"四角形","しかくけい"]
[704,null,"正方形","せいほうけい"]
[705,null,"辺の長さ","へんのながさ"]
[706,null,"消費者","しょうひしゃ"]
[707,null,"品物","しなもの"]
[708,null,"物品","ぶっぴん"]
[709,null,"半径","はんけい"]
[710,null,"直径","ちょっけい"]
[711,"P43","文章","ぶんしょう"]
[712,null,"あま酒を飲む","あまざけをのむ"]
[713,null,"去っていく","さっていく"]
[714,null,"急いで追う","いそいでおう"]
[715,"P44","具体例","ぐたいれい"]
[716,null,"活動","かつどう"]
[717,null,"相手","あいて"]
[718,"P45","一輪車","いちりんしゃ"]
[719,null,"協力","きょうりょく"]
[720,null,"好き","すき"]
[721,null,"仲間","なかま"]
[722,null,"全員","ぜんいん"]
[723,null,"息が合う","いきがあう"]
[724,"P46","回転","かいてん"]
[725,null,"乗車","じょうしゃ"]
[726,"P47","風車","ふうしゃ（かざぐるま）"]
[727,null,"練習","れんしゅう"]
[728,null,"他教科","たきょうか"]
[729,"P48","短歌","たんか"]
[730,null,"調子","ちょうし"]
[731,null,"作品","さくひん"]
[732,null,"表す","あらわす"]
[733,null,"声に出す","こえにだす"]
[734,null,"親しむ","したしむ"]
[735,null,"金色堂","こんじきどう"]
[736,"P50","感想文","かんそうぶん"]
[737,null,"別々","べつべつ"]
[738,null,"仲良し","なかよし"]
[739,null,"心に残る","こころにのこる"]
[740,"P51","集まる","あつまる"]
[741,null,"公園","こうえん"]
[742,null,"植える","うえる"]
[743,null,"丸で囲む","まるでかこむ"]
[744,null,"水飲み場","みずのみば"]
[745,null,"よう児連れ","ようじづれ"]
[746,null,"母親","ははおや"]
[747,null,"最近","さいきん"]
[748,null,"熱中","ねっちゅう"]
[749,null,"禁止","きんし"]
[750,null,"本格的","ほんかくてき"]
[751,null,"空間","くうかん"]
[752,null,"つゆ明け","つゆあけ"]
[753,null,"木の下","きのした"]
[754,"P52","白熱","はくねつ"]
[755,null,"有利","ゆうり"]
[756,null,"太陽","たいよう"]
[757,null,"大きな葉","おおきなは"]
[758,null,"笑う","わらう"]
[759,"P53","水分","すいぶん"]
[760,null,"養分","ようぶん"]
[761,null,"今度","こんど"]
[762,null,"地面の下","じめんのした"]
[763,null,"地上","ちじょう"]
[764,null,"枝葉","えだは"]
[765,"P54","帰省ラッシュ","きせいらっしゅ"]
[766,null,"海外旅行","かいがいりょこう"]
[767,null,"夏休みの半ば","なつやすみのなかば"]
[768,null,"家の周り","いえのまわり"]
[769,null,"喜びに満ちる","よろこびにみちる"]
[770,null,"祖父母の家","そふぼのいえ"]
[771,"P55","遊ぶ","あそぶ"]
[772,null,"一週間","いっしゅうかん"]
[773,null,"台風","たいふう"]
[774,null,"消す","けす"]
[775,null,"最初","さいしょ"]
[776,null,"落ちる","おちる"]
[777,null,"一夜明ける","いちやあける"]
[778,null,"晴れ上がる","はれあがる"]
[779,null,"光を受ける","ひかりをうける"]
[780,"P56","強い風","つよいかぜ"]
[781,"P57","新学期","しんがっき"]
[782,null,"放課後","ほうかご"]
[783,null,"日を浴びる","ひをあびる"]
[784,"P58","地下に広がる","ちかにひろがる"]
[785,"P59","真ん中","まんなか"]
[786,null,"変わらない","かわらない"]
[787,null,"芽を出す","めをだす"]
[788,null,"息を殺す","息を殺す"]
[789,null,"空を見上げる","そらをみあげる"]
[790,null,"想像","そうぞう"]
[791,"P60","体験","たいけん"]
[792,null,"出来事","できごと"]
[793,null,"手順","てじゅん"]
[794,null,"関わり","かかわり"]
[795,"P61","自然","しぜん"]
[796,null,"引用","いんようする"]
[797,"P63","世界地図","せかいちず"]
[798,null,"神話","しんわ"]
[799,null,"童話","どうわ"]
[800,null,"図書委員","としょいいん"]
[801,null,"使う","つかう"]
[802,null,"返す","かえす"]
[803,null,"起立","きりつ"]
[804,null,"気をつけ","きをつけ"]
[805,null,"礼をする","れいをする"]
[806,null,"指名する","しめいする"]
[807,null,"面積の問題","めんせきのもんだい"]
[808,null,"倍返し","ばいがえし"]
[809,null,"横の長さ","よこのながさ"]
[810,null,"昭和の子","しょうわのこ"]
[811,null,"先生に相談する","せんせいにそうだんする"]
[812,null,"鼻血が出る","はなぢがでる"]
[813,null,"歯をみがく","はをみがく"]
[814,null,"実物","じつぶつ"]
[815,null,"昔遊びの会","むかしあそびのかい"]
[816,null,"体育館","たいいくかん"]
[817,null,"軽い人","かるいひと"]
[818,null,"気が重い","きがおもい"]
[819,null,"係の仕事","かかりのしごと"]
[820,null,"次々走る","つぎつぎはしる"]
[821,null,"笛をふく","ふえをふく"]
[822,null,"校庭","こうてい"]
[823,null,"秒速","びょうそく"]
[824,"P65","当然","とうぜん"]
[825,null,"予想する","よそうする"]
[826,null,"後ろに続く","うしろにつづく"]
[827,"P66","徒競走","ときょうそう"]
[828,null,"集合時間","しゅうごうじかん"]
[829,"P67","歴史","れきし"]
[830,null,"博物館","はくぶつかん"]
[831,null,"衣料品","いりょうひん"]
[832,null,"健康食品","けんこうしょくひん"]
[833,null,"栄養を欠く","えいようをかく"]
[834,null,"国民の祝日","こくみんのしゅくじつ"]
[835,null,"牧場で遊ぶ","ぼくじょうであそぶ"]
[836,"P68","きずは浅い","きずはあさい"]
[837,null,"天体望遠鏡","てんたいぼうえんきょう"]
[838,"P69","整理","せいり"]
[839,null,"得意","とくい"]
[840,null,"世界の神話","せかいのしんわ"]
[841,null,"調べる","しらべる"]
[842,null,"飲み物","のみもの"]
[843,"P70","野原の仲間","のはらのなかま"]
[844,"P71","詩集","ししゅう"]
[845,"P73","調子を整える","ちょうしをととのえる"]
[846,null,"別の言葉","べつのことば"]
[847,null,"大きな紙","おおきなかみ"]
[848,"P74","春休み","はるやすみ"]
[849,null,"冬芽","ふゆめ"]
[850,"P75","雪合戦","ゆきがっせん"]
[851,null,"冬眠","とうみん"]
[852,"P76","要約する","ようやくする"]
[853,null,"必要","ひつよう"]
[854,null,"短くまとめる","みじかくまとめる"]
[855,null,"調査する","ちょうさする"]
[856,null,"白い船体","しろいせんたい"]
[857,"P77","日本各地","にほんかくち"]
[858,null,"たまごを産む","たまごをうむ"]
[859,null,"海流","かいりゅう"]
[860,null,"包まれる","つつまれる"]
[861,null,"第一歩","だいいっぽ"]
[862,"P78","追い求める","おいもとめる"]
[863,null,"作業","さぎょう"]
[864,null,"体調が悪い","たいちょうがわるい"]
[865,null,"体長は二センチ","たいちょうはにせんち"]
[866,null,"隊長の作戦","たいちょうのさくせん"]
[867,null,"成長する","せいちょうする"]
[868,"P79","運ばれる","はこばれる"]
[869,null,"木の年輪","きのねんりん"]
[870,null,"北赤道海流","きたせきどうかいりゅう"]
[871,"P80","二十日分","はつかぶん"]
[872,null,"たどり着く","たどりつく"]
[873,null,"海底火山","かいていかざん"]
[874,null,"海山が連なる","かいざんがつらなる"]
[875,"P81","役に立つ","やくにたつ"]
[876,null,"照らし合わす","てらしあわす"]
[877,null,"新月から満月","しんげつからまんげつ"]
[878,null,"マリアナ諸島","まりあなしょとう"]
[879,null,"日付","ひづけ"]
[880,"P82","塩分","えんぶん"]
[881,null,"期待は高まる","きたいはたかまる"]
[882,null,"海水浴","かいすいよく"]
[883,null,"南側","みなみがわ"]
[884,null,"明け方","あけがた"]
[885,"P83","研究室","けんきゅうしつ"]
[886,"P85","苦労","くろう"]
[887,null,"科学読み物","かがくよみもの"]
[888,"P86","虫の観察","むしのかんさつ"]
[889,null,"加わる","くわわる"]
[890,null,"社会","しゃかい"]
[891,"P87","美化する","びかする"]
[892,null,"ごみを拾う","ごみをひろう"]
[893,null,"疲労がたまる","ひろうがたまる"]
[894,null,"公園の遊具","こうえんのゆうぐ"]
[895,null,"写真","しゃしん"]
[896,null,"寒い日","さむいひ"]
[897,null,"気が短い","きがみじかい"]
[898,null,"木に登る","きにのぼる"]
[899,null,"信号を待つ","しんごうをまつ"]
[900,null,"道路工事","どうろこうじ"]
[901,null,"洋服を整理する","ようふくをせいりする"]
[902,null,"二階で勉強する","にかいでべんきょうする"]
[903,null,"漢字を書く","かんじをかく"]
[904,null,"お客様","おきゃくさま"]
[905,null,"手帳を見る","てちょうをみる"]
[906,null,"お湯","おゆ"]
[907,null,"火を消す","ひをけす"]
[908,null,"屋根付きの車庫","やねつきのしゃこ"]
[909,null,"うちの両親","うちのりょうしん"]
[910,null,"柱を立てる","はしらをたてる"]
[911,null,"身長を測る","しんちょうをはかる"]
[912,null,"時間を計る","じかんをはかる"]
[913,null,"重さを量る","おもさをはかる"]
[914,"P88","覚える","おぼえる"]
[915,null,"メモを取る","めもをとる"]
[916,null,"目的に合う","もくてきにあう"]
[917,"P89","放送委員会","ほうそういいんかい"]
[918,null,"音楽","おんがく"]
[919,null,"集会","しゅうかい"]
[920,null,"友達","ともだち"]
[921,"P90","簡単","かんたん"]
[922,null,"金曜日","きんようび"]
[923,null,"速いスピード","はやいスピード"]
[924,null,"早く始める","はやくはじめる"]
[925,"P91","外部の方","がいぶのかた"]
[926,"P92","等分","とうぶん"]
[927,null,"改良","かいりょう"]
[928,null,"木刀","ぼくとう"]
[929,null,"戸外","こがい"]
[930,null,"竹林","ちくりん"]
[931,null,"多数決","たすうけつ"]
[932,null,"伝言板","でんごんばん"]
[933,"P93","願望","がんぼう"]
[934,null,"選挙","せんきょ"]
[935,null,"救助","きゅうじょ"]
[936,null,"高低","こうてい"]
[937,null,"売買","ばいばい"]
[938,null,"花束","はなたば"]
[939,null,"消毒","しょうどく"]
[940,null,"岩石","がんせき"]
[941,null,"右折","うせつ"]
[942,null,"登山","とざん"]
[943,null,"最多勝","さいたしょう"]
[944,null,"取得する","しゅとくする"]
[945,null,"着陸","ちゃくりく"]
[946,null,"軽重をつける","けいちょうをつける"]
[947,null,"強弱","きょうじゃく"]
[948,null,"勝敗を決める","しょうはいをきめる"]
[949,null,"未来","みらい"]
[950,null,"働く","はたらく"]
[951,null,"平和を願う","へいわをねがう"]
[952,null,"加入する","かにゅうする"]
[953,"P97","百科事典","ひゃっかじてん"]
[954,null,"参考図書","さんこうとしょ"]
[955,null,"司書","ししょ"]
[956,"P99","仕組み","しくみ"]
[957,"P100","硬貨","こうか"]
[958,null,"区別","くべつ"]
[959,"P102","病気を治す","びょうきをなおす"]
[960,null,"字を直す","じをなおす"]
[961,null,"手芸用品","しゅげいようひん"]
[962,null,"感心な行い","かんしんなおこない"]
[963,null,"関心をもつ","かんしんをもつ"]
[964,"P103","野菜の量","やさいのりょう"]
[965,null,"米作","べいさく"]
[966,null,"意外な結果","いがいなけっか"]
[967,null,"きのこ以外食べない","きのこいがいたべない"]
[968,"P104","一本道","いっぽんみち"]
[969,"P105","真ん丸","まんまる"]
[970,null,"軽くて転がる","かるくてころがる"]
[971,null,"飛び込む","とびこむ"]
[972,"P106","停留所","ていりゅうじょ"]
[973,null,"店番をする","みせばんをする"]
[974,null,"粉雪がまう","こなゆきがまう"]
[975,null,"冷たい風","つめたいかぜ"]
[976,"P108","世界の果て","せかいのはて"]
[977,"P109","初雪の降る日","はつゆきのふるひ"]
[978,null,"目を見開く","めをみひらく"]
[979,"P111","お日様","おひさま"]
[980,"P112","唱える","となえる"]
[981,null,"草屋根","くさやね"]
[982,"P113","拾い上げる","ひろいあげる"]
[983,"P114","草の種","くさのたね"]
[984,"P117","息をすう","いきをすう"]
[985,"P118","食堂","しょくどう"]
[986,null,"取り囲む","とりかこむ"]
[987,"P123","進級","しんきゅう"]
[988,null,"毛筆","もうひつ"]
[989,null,"他校生","たこうせい"]
[990,null,"国際交流","こくさいこうりゅう"]
[991,null,"必死","ひっし"]
[992,"P124","飛行機","ひこうき"]
[993,"P127","図表を使う","ずひょうをつかう"]
[994,"P128","重要な言葉","じゅうようなことば"]
[995,null,"登場人物","とうじょうじんぶつ"]
[996,null,"文章の種類","ぶんしょうのしゅるい"]
[997,"P129","印象づける","いんしょうづける"]
[998,null,"短くする","みじかくする"]
[999,null,"国語","こくご"]
[1000,null,"光村図書",{"$f":"PHONETIC(C1001)","v":"みつむらとしょ"}]
[null,null,null,""]
[]
[null,null,null,""]
[null,null,null,""]
[null,null,null,""]
[null,null,null,""]
[null,null,null,""]
[null,null,null,""]
[null,null,null,""]
[null,null,null,""]
[null,null,null,""]
[null,null,null,""]
[null,null,null,""]
[null,null,null,""]
[null,null,null,""]
[null,null,null,""]
[null,null,null,""]
[null,null,null,""]
[null,null,null,""]
[null,null,null,""]
[null,null,null,""]
[null,null,null,""]
[null,null,null,""]
[null,null,null,""]
[null,null,null,""]
[null,null,null,""]
[null,null,null,""]
[null,null,null,""]
[null,null,null,""]
[null,null,null,""]
[null,null,null,""]
[null,null,null,""]
[null,null,null,""]
[null,null,null,""]
[null,null,null,""]
[null,null,null,""]
[null,null,null,""]
[null,null,null,""]
[null,null,null,""]
[null,null,null,""]
[null,null,null,""]
[null,null,null,""]
[null,null,null,{"$f":"PHONETIC(C1044)","v":""}]
[null,null,null,""]
[null,null,null,""]
[null,null,null,""]
[null,null,null,""]
[null,null,null,""]
[null,null,null,""]
[null,null,null,""]
[null,null,null,""]
[null,null,null,""]
[null,null,null,""]
[null,null,null,""]
[null,null,null,""]
[null,null,null,""]
[null,null,null,""]
[null,null,null,""]
[null,null,null,""]
[null,null,null,""]
[null,null,null,""]
[null,null,null,""]
[null,null,null,""]
[null,null,null,""]
[null,null,null,""]
[null,null,null,""]
[null,null,null,""]
[null,null,null,""]
[null,null,null,""]
[null,null,null,""]
[null,null,null,""]
[null,null,null,""]
[null,null,null,""]
[null,null,null,""]
[null,null,null,""]
[null,null,null,""]
[null,null,null,""]
[null,null,null,""]
[null,null,null,""]
[null,null,null,""]
[null,null,null,""]
[null,null,null,""]
[null,null,null,""]
[null,null,null,""]
[null,null,null,""]
[null,null,null,""]
[null,null,null,""]
[null,null,null,""]
[null,null,null,""]
[null,null,null,""]
[null,null,null,""]
[null,null,null,""]
[null,null,null,""]
[null,null,null,""]
[null,null,null,""]
[null,null,null,""]
[null,null,null,""]
[null,null,null,""]
[null,null,null,""]
[null,null,null,""]
[null,null,null,""]
[null,null,null,""]
[null,null,null,""]
[null,null,null,""]
[null,null,null,""]
[null,null,null,""]
[null,null,null,{"$f":"PHONETIC(C1108)","v":""}]
[null,null,null,""]
[null,null,null,""]
[null,null,null,""]
[null,null,null,""]
[null,null,null,""]
[null,null,null,""]
[null,null,null,""]
[null,null,null,""]
[null,null,null,""]
[null,null,null,""]
[null,null,null,""]
[null,null,null,""]
[null,null,null,""]
[null,null,null,""]
[null,null,null,""]
[null,null,null,""]
[null,null,null,""]
[null,null,null,""]
[null,null,null,""]
[null,null,null,""]
[null,null,null,""]
[null,null,null,""]
[null,null,null,""]
[null,null,null,""]
[null,null,null,""]
[null,null,null,""]
[null,null,null,""]
[null,null,null,""]
[null,null,null,""]
[null,null,null,""]
[null,null,null,""]
[null,null,null,""]
[null,null,null,""]
[null,null,null,""]
[null,null,null,""]
[null,null,null,""]
[null,null,null,""]
[null,null,null,""]
[null,null,null,""]
[null,null,null,""]
[null,null,null,""]
[null,null,null,""]
[null,null,null,""]
[null,null,null,""]
[null,null,null,""]
[null,null,null,""]
[null,null,null,""]
[null,null,null,""]
[null,null,null,""]
[null,null,null,""]
[null,null,null,""]
[null,null,null,""]
[null,null,null,""]
[null,null,null,""]
[null,null,null,""]
[null,null,null,""]
[null,null,null,""]
[null,null,null,""]
[null,null,null,""]
[null,null,null,""]
[null,null,null,""]
[null,null,null,""]
[null,null,null,""]
[null,null,null,{"$f":"PHONETIC(C1172)","v":""}]
[null,null,null,""]
[null,null,null,""]
[null,null,null,""]
[null,null,null,""]
[null,null,null,""]
[null,null,null,""]
[null,null,null,""]
[null,null,null,""]
[null,null,null,""]
[null,null,null,""]
[null,null,null,""]
[null,null,null,""]
[null,null,null,""]
[null,null,null,""]
[null,null,null,""]
[null,null,null,""]
[null,null,null,""]
[null,null,null,""]
[null,null,null,""]
[null,null,null,""]
[null,null,null,""]
[null,null,null,""]
[null,null,null,""]
[null,null,null,""]
[null,null,null,""]
[null,null,null,""]
[null,null,null,""]
[null,null,null,""]
[null,null,null,""]
[null,null,null,""]
[null,null,null,""]
[null,null,null,""]
[null,null,null,""]
[null,null,null,""]
[null,null,null,""]
[null,null,null,""]
[null,null,null,""]
[null,null,null,""]
[null,null,null,""]
[null,null,null,""]
[null,null,null,""]
[null,null,null,""]
[null,null,null,""]
[null,null,null,""]
[null,null,null,""]
[null,null,null,""]
[null,null,null,""]
[null,null,null,""]
[null,null,null,""]
[null,null,null,""]
[null,null,null,""]
[null,null,null,""]
[null,null,null,""]
[null,null,null,""]
[null,null,null,""]
[null,null,null,""]
[null,null,null,""]
[null,null,null,""]
[null,null,null,""]
[null,null,null,""]
[null,null,null,""]
[null,null,null,""]
[null,null,null,""]
[null,null,null,{"$f":"PHONETIC(C1236)","v":""}]
[null,null,null,""]
[null,null,null,""]
[null,null,null,""]
[null,null,null,""]
[null,null,null,""]
[null,null,null,""]
[null,null,null,""]
[null,null,null,""]
[null,null,null,""]
[null,null,null,""]
[null,null,null,""]
[null,null,null,""]
[null,null,null,""]
[null,null,null,""]
[null,null,null,""]
[null,null,null,""]
[null,null,null,""]
[null,null,null,""]
[null,null,null,""]
[null,null,null,""]
[null,null,null,""]
[null,null,null,""]
[null,null,null,""]
[null,null,null,""]
[null,null,null,""]
[null,null,null,""]
[null,null,null,""]
[null,null,null,""]
[null,null,null,""]
[null,null,null,""]
[null,null,null,""]
[null,null,null,""]
[null,null,null,""]
[null,null,null,""]
[null,null,null,""]
[null,null,null,""]
[null,null,null,""]
[null,null,null,""]
[null,null,null,""]
[null,null,null,""]
[null,null,null,""]
[null,null,null,""]
[null,null,null,""]
[null,null,null,""]
[null,null,null,""]
[null,null,null,""]
[null,null,null,""]
[null,null,null,""]
[null,null,null,""]
[null,null,null,""]
[null,null,null,""]
[null,null,null,""]
[null,null,null,""]
[null,null,null,""]
[null,null,null,""]
[null,null,null,""]
[null,null,null,""]
[null,null,null,""]
[null,null,null,""]
[null,null,null,""]
[null,null,null,""]
[null,null,null,""]
[null,null,null,""]
[null,null,null,{"$f":"PHONETIC(C1300)","v":""}]
[null,null,null,""]
[null,null,null,""]
[null,null,null,""]
[null,null,null,""]
[null,null,null,""]
[null,null,null,""]
[null,null,null,""]
[null,null,null,""]
[null,null,null,""]
[null,null,null,""]
[null,null,null,""]
[null,null,null,""]
[null,null,null,""]
[null,null,null,""]
[null,null,null,""]
[null,null,null,""]
[null,null,null,""]
[null,null,null,""]
[null,null,null,""]
[null,null,null,""]
[null,null,null,""]
[null,null,null,""]
[null,null,null,""]
[null,null,null,""]
[null,null,null,""]
[null,null,null,""]
[null,null,null,""]
[null,null,null,""]
[null,null,null,""]
[null,null,null,""]
[null,null,null,""]
[null,null,null,""]
[null,null,null,""]
[null,null,null,""]
[null,null,null,""]
[null,null,null,""]
[null,null,null,""]
[null,null,null,""]

{"sheet":"問題印刷","index":1,"n_rows":24,"n_cols":22,"rows_kept":24,"cut":false,"hidden":false,"merged":[]}
[{"$f":"B1+1","v":967},{"$f":"C1+1","v":966},{"$f":"D1+1","v":965},{"$f":"E1+1","v":964},963,962,961,960,959,958,957,956,955,954,953,{"$f":"Q1+1","v":952},951,null,null,1,"から",1000]
[]
[{"$f":"IF(VLOOKUP(A1,問題1000!$A$1:$D$1001,2,FALSE)=\"\",\"\",\"P\"&VLOOKUP(A1,問題1000!$A$1:$D$1001,2,FALSE))","v":""},{"$f":"IF(VLOOKUP(B1,問題1000!$A$1:$D$1001,2,FALSE)=\"\",\"\",\"P\"&VLOOKUP(B1,問題1000!$A$1:$D$1001,2,FALSE))","v":""},{"$f":"IF(VLOOKUP(C1,問題1000!$A$1:$D$1001,2,FALSE)=\"\",\"\",\"P\"&VLOOKUP(C1,問題1000!$A$1:$D$1001,2,FALSE))","v":""},{"$f":"IF(VLOOKUP(D1,問題1000!$A$1:$D$1001,2,FALSE)=\"\",\"\",\"P\"&VLOOKUP(D1,問題1000!$A$1:$D$1001,2,FALSE))","v":"PP103"},{"$f":"IF(VLOOKUP(E1,問題1000!$A$1:$D$1001,2,FALSE)=\"\",\"\",\"P\"&VLOOKUP(E1,問題1000!$A$1:$D$1001,2,FALSE))","v":""},{"$f":"IF(VLOOKUP(F1,問題1000!$A$1:$D$1001,2,FALSE)=\"\",\"\",\"P\"&VLOOKUP(F1,問題1000!$A$1:$D$1001,2,FALSE))","v":""},{"$f":"IF(VLOOKUP(G1,問題1000!$A$1:$D$1001,2,FALSE)=\"\",\"\",\"P\"&VLOOKUP(G1,問題1000!$A$1:$D$1001,2,FALSE))","v":""},{"$f":"IF(VLOOKUP(H1,問題1000!$A$1:$D$1001,2,FALSE)=\"\",\"\",\"P\"&VLOOKUP(H1,問題1000!$A$1:$D$1001,2,FALSE))","v":""},{"$f":"IF(VLOOKUP(I1,問題1000!$A$1:$D$1001,2,FALSE)=\"\",\"\",\"P\"&VLOOKUP(I1,問題1000!$A$1:$D$1001,2,FALSE))","v":"PP102"},{"$f":"IF(VLOOKUP(J1,問題1000!$A$1:$D$1001,2,FALSE)=\"\",\"\",\"P\"&VLOOKUP(J1,問題1000!$A$1:$D$1001,2,FALSE))","v":""},{"$f":"IF(VLOOKUP(K1,問題1000!$A$1:$D$1001,2,FALSE)=\"\",\"\",\"P\"&VLOOKUP(K1,問題1000!$A$1:$D$1001,2,FALSE))","v":"PP100"},{"$f":"IF(VLOOKUP(L1,問題1000!$A$1:$D$1001,2,FALSE)=\"\",\"\",\"P\"&VLOOKUP(L1,問題1000!$A$1:$D$1001,2,FALSE))","v":"PP99"},{"$f":"IF(VLOOKUP(M1,問題1000!$A$1:$D$1001,2,FALSE)=\"\",\"\",\"P\"&VLOOKUP(M1,問題1000!$A$1:$D$1001,2,FALSE))","v":""},{"$f":"IF(VLOOKUP(N1,問題1000!$A$1:$D$1001,2,FALSE)=\"\",\"\",\"P\"&VLOOKUP(N1,問題1000!$A$1:$D$1001,2,FALSE))","v":""},{"$f":"IF(VLOOKUP(O1,問題1000!$A$1:$D$1001,2,FALSE)=\"\",\"\",\"P\"&VLOOKUP(O1,問題1000!$A$1:$D$1001,2,FALSE))","v":"PP97"},{"$f":"IF(VLOOKUP(P1,問題1000!$A$1:$D$1001,2,FALSE)=\"\",\"\",\"P\"&VLOOKUP(P1,問題1000!$A$1:$D$1001,2,FALSE))","v":""},{"$f":"IF(VLOOKUP(Q1,問題1000!$A$1:$D$1001,2,FALSE)=\"\",\"\",\"P\"&VLOOKUP(Q1,問題1000!$A$1:$D$1001,2,FALSE))","v":""}]
[{"$f":"VLOOKUP(A1,問題1000!$A$1:$D$1001,3,FALSE)","v":"きのこ以外食べない"},{"$f":"VLOOKUP(B1,問題1000!$A$1:$D$1001,3,FALSE)","v":"意外な結果"},{"$f":"VLOOKUP(C1,問題1000!$A$1:$D$1001,3,FALSE)","v":"米作"},{"$f":"VLOOKUP(D1,問題1000!$A$1:$D$1001,3,FALSE)","v":"野菜の量"},{"$f":"VLOOKUP(E1,問題1000!$A$1:$D$1001,3,FALSE)","v":"関心をもつ"},{"$f":"VLOOKUP(F1,問題1000!$A$1:$D$1001,3,FALSE)","v":"感心な行い"},{"$f":"VLOOKUP(G1,問題1000!$A$1:$D$1001,3,FALSE)","v":"手芸用品"},{"$f":"VLOOKUP(H1,問題1000!$A$1:$D$1001,3,FALSE)","v":"字を直す"},{"$f":"VLOOKUP(I1,問題1000!$A$1:$D$1001,3,FALSE)","v":"病気を治す"},{"$f":"VLOOKUP(J1,問題1000!$A$1:$D$1001,3,FALSE)","v":"区別"},{"$f":"VLOOKUP(K1,問題1000!$A$1:$D$1001,3,FALSE)","v":"硬貨"},{"$f":"VLOOKUP(L1,問題1000!$A$1:$D$1001,3,FALSE)","v":"仕組み"},{"$f":"VLOOKUP(M1,問題1000!$A$1:$D$1001,3,FALSE)","v":"司書"},{"$f":"VLOOKUP(N1,問題1000!$A$1:$D$1001,3,FALSE)","v":"参考図書"},{"$f":"VLOOKUP(O1,問題1000!$A$1:$D$1001,3,FALSE)","v":"百科事典"},{"$f":"VLOOKUP(P1,問題1000!$A$1:$D$1001,3,FALSE)","v":"加入する"},{"$f":"VLOOKUP(Q1,問題1000!$A$1:$D$1001,3,FALSE)","v":"平和を願う"}]
[{"$f":"B5+1","v":984},{"$f":"C5+1","v":983},{"$f":"D5+1","v":982},981,980,979,978,977,976,975,974,973,972,971,970,{"$f":"Q5+1","v":969},{"$f":"A1+1","v":968}]
[]
[{"$f":"IF(VLOOKUP(A5,問題1000!$A$1:$D$1001,2,FALSE)=\"\",\"\",\"P\"&VLOOKUP(A5,問題1000!$A$1:$D$1001,2,FALSE))","v":"PP117"},{"$f":"IF(VLOOKUP(B5,問題1000!$A$1:$D$1001,2,FALSE)=\"\",\"\",\"P\"&VLOOKUP(B5,問題1000!$A$1:$D$1001,2,FALSE))","v":"PP114"},{"$f":"IF(VLOOKUP(C5,問題1000!$A$1:$D$1001,2,FALSE)=\"\",\"\",\"P\"&VLOOKUP(C5,問題1000!$A$1:$D$1001,2,FALSE))","v":"PP113"},{"$f":"IF(VLOOKUP(D5,問題1000!$A$1:$D$1001,2,FALSE)=\"\",\"\",\"P\"&VLOOKUP(D5,問題1000!$A$1:$D$1001,2,FALSE))","v":""},{"$f":"IF(VLOOKUP(E5,問題1000!$A$1:$D$1001,2,FALSE)=\"\",\"\",\"P\"&VLOOKUP(E5,問題1000!$A$1:$D$1001,2,FALSE))","v":"PP112"},{"$f":"IF(VLOOKUP(F5,問題1000!$A$1:$D$1001,2,FALSE)=\"\",\"\",\"P\"&VLOOKUP(F5,問題1000!$A$1:$D$1001,2,FALSE))","v":"PP111"},{"$f":"IF(VLOOKUP(G5,問題1000!$A$1:$D$1001,2,FALSE)=\"\",\"\",\"P\"&VLOOKUP(G5,問題1000!$A$1:$D$1001,2,FALSE))","v":""},{"$f":"IF(VLOOKUP(H5,問題1000!$A$1:$D$1001,2,FALSE)=\"\",\"\",\"P\"&VLOOKUP(H5,問題1000!$A$1:$D$1001,2,FALSE))","v":"PP109"},{"$f":"IF(VLOOKUP(I5,問題1000!$A$1:$D$1001,2,FALSE)=\"\",\"\",\"P\"&VLOOKUP(I5,問題1000!$A$1:$D$1001,2,FALSE))","v":"PP108"},{"$f":"IF(VLOOKUP(J5,問題1000!$A$1:$D$1001,2,FALSE)=\"\",\"\",\"P\"&VLOOKUP(J5,問題1000!$A$1:$D$1001,2,FALSE))","v":""},{"$f":"IF(VLOOKUP(K5,問題1000!$A$1:$D$1001,2,FALSE)=\"\",\"\",\"P\"&VLOOKUP(K5,問題1000!$A$1:$D$1001,2,FALSE))","v":""},{"$f":"IF(VLOOKUP(L5,問題1000!$A$1:$D$1001,2,FALSE)=\"\",\"\",\"P\"&VLOOKUP(L5,問題1000!$A$1:$D$1001,2,FALSE))","v":""},{"$f":"IF(VLOOKUP(M5,問題1000!$A$1:$D$1001,2,FALSE)=\"\",\"\",\"P\"&VLOOKUP(M5,問題1000!$A$1:$D$1001,2,FALSE))","v":"PP106"},{"$f":"IF(VLOOKUP(N5,問題1000!$A$1:$D$1001,2,FALSE)=\"\",\"\",\"P\"&VLOOKUP(N5,問題1000!$A$1:$D$1001,2,FALSE))","v":""},{"$f":"IF(VLOOKUP(O5,問題1000!$A$1:$D$1001,2,FALSE)=\"\",\"\",\"P\"&VLOOKUP(O5,問題1000!$A$1:$D$1001,2,FALSE))","v":""},{"$f":"IF(VLOOKUP(P5,問題1000!$A$1:$D$1001,2,FALSE)=\"\",\"\",\"P\"&VLOOKUP(P5,問題1000!$A$1:$D$1001,2,FALSE))","v":"PP105"},{"$f":"IF(VLOOKUP(Q5,問題1000!$A$1:$D$1001,2,FALSE)=\"\",\"\",\"P\"&VLOOKUP(Q5,問題1000!$A$1:$D$1001,2,FALSE))","v":"PP104"}]
[{"$f":"VLOOKUP(A5,問題1000!$A$1:$D$1001,3,FALSE)","v":"息をすう"},{"$f":"VLOOKUP(B5,問題1000!$A$1:$D$1001,3,FALSE)","v":"草の種"},{"$f":"VLOOKUP(C5,問題1000!$A$1:$D$1001,3,FALSE)","v":"拾い上げる"},{"$f":"VLOOKUP(D5,問題1000!$A$1:$D$1001,3,FALSE)","v":"草屋根"},{"$f":"VLOOKUP(E5,問題1000!$A$1:$D$1001,3,FALSE)","v":"唱える"},{"$f":"VLOOKUP(F5,問題1000!$A$1:$D$1001,3,FALSE)","v":"お日様"},{"$f":"VLOOKUP(G5,問題1000!$A$1:$D$1001,3,FALSE)","v":"目を見開く"},{"$f":"VLOOKUP(H5,問題1000!$A$1:$D$1001,3,FALSE)","v":"初雪の降る日"},{"$f":"VLOOKUP(I5,問題1000!$A$1:$D$1001,3,FALSE)","v":"世界の果て"},{"$f":"VLOOKUP(J5,問題1000!$A$1:$D$1001,3,FALSE)","v":"冷たい風"},{"$f":"VLOOKUP(K5,問題1000!$A$1:$D$1001,3,FALSE)","v":"粉雪がまう"},{"$f":"VLOOKUP(L5,問題1000!$A$1:$D$1001,3,FALSE)","v":"店番をする"},{"$f":"VLOOKUP(M5,問題1000!$A$1:$D$1001,3,FALSE)","v":"停留所"},{"$f":"VLOOKUP(N5,問題1000!$A$1:$D$1001,3,FALSE)","v":"飛び込む"},{"$f":"VLOOKUP(O5,問題1000!$A$1:$D$1001,3,FALSE)","v":"軽くて転がる"},{"$f":"VLOOKUP(P5,問題1000!$A$1:$D$1001,3,FALSE)","v":"真ん丸"},{"$f":"VLOOKUP(Q5,問題1000!$A$1:$D$1001,3,FALSE)","v":"一本道"}]
[null,{"$f":"C9+1","v":1000},{"$f":"D9+1","v":999},998,997,996,995,994,993,992,991,990,989,988,987,{"$f":"Q9+1","v":986},{"$f":"A5+1","v":985}]
[]
[null,{"$f":"IF(VLOOKUP(B9,問題1000!$A$1:$D$1001,2,FALSE)=\"\",\"\",\"P\"&VLOOKUP(B9,問題1000!$A$1:$D$1001,2,FALSE))","v":""},{"$f":"IF(VLOOKUP(C9,問題1000!$A$1:$D$1001,2,FALSE)=\"\",\"\",\"P\"&VLOOKUP(C9,問題1000!$A$1:$D$1001,2,FALSE))","v":""},{"$f":"IF(VLOOKUP(D9,問題1000!$A$1:$D$1001,2,FALSE)=\"\",\"\",\"P\"&VLOOKUP(D9,問題1000!$A$1:$D$1001,2,FALSE))","v":""},{"$f":"IF(VLOOKUP(E9,問題1000!$A$1:$D$1001,2,FALSE)=\"\",\"\",\"P\"&VLOOKUP(E9,問題1000!$A$1:$D$1001,2,FALSE))","v":"PP129"},{"$f":"IF(VLOOKUP(F9,問題1000!$A$1:$D$1001,2,FALSE)=\"\",\"\",\"P\"&VLOOKUP(F9,問題1000!$A$1:$D$1001,2,FALSE))","v":""},{"$f":"IF(VLOOKUP(G9,問題1000!$A$1:$D$1001,2,FALSE)=\"\",\"\",\"P\"&VLOOKUP(G9,問題1000!$A$1:$D$1001,2,FALSE))","v":""},{"$f":"IF(VLOOKUP(H9,問題1000!$A$1:$D$1001,2,FALSE)=\"\",\"\",\"P\"&VLOOKUP(H9,問題1000!$A$1:$D$1001,2,FALSE))","v":"PP128"},{"$f":"IF(VLOOKUP(I9,問題1000!$A$1:$D$1001,2,FALSE)=\"\",\"\",\"P\"&VLOOKUP(I9,問題1000!$A$1:$D$1001,2,FALSE))","v":"PP127"},{"$f":"IF(VLOOKUP(J9,問題1000!$A$1:$D$1001,2,FALSE)=\"\",\"\",\"P\"&VLOOKUP(J9,問題1000!$A$1:$D$1001,2,FALSE))","v":"PP124"},{"$f":"IF(VLOOKUP(K9,問題1000!$A$1:$D$1001,2,FALSE)=\"\",\"\",\"P\"&VLOOKUP(K9,問題1000!$A$1:$D$1001,2,FALSE))","v":""},{"$f":"IF(VLOOKUP(L9,問題1000!$A$1:$D$1001,2,FALSE)=\"\",\"\",\"P\"&VLOOKUP(L9,問題1000!$A$1:$D$1001,2,FALSE))","v":""},{"$f":"IF(VLOOKUP(M9,問題1000!$A$1:$D$1001,2,FALSE)=\"\",\"\",\"P\"&VLOOKUP(M9,問題1000!$A$1:$D$1001,2,FALSE))","v":""},{"$f":"IF(VLOOKUP(N9,問題1000!$A$1:$D$1001,2,FALSE)=\"\",\"\",\"P\"&VLOOKUP(N9,問題1000!$A$1:$D$1001,2,FALSE))","v":""},{"$f":"IF(VLOOKUP(O9,問題1000!$A$1:$D$1001,2,FALSE)=\"\",\"\",\"P\"&VLOOKUP(O9,問題1000!$A$1:$D$1001,2,FALSE))","v":"PP123"},{"$f":"IF(VLOOKUP(P9,問題1000!$A$1:$D$1001,2,FALSE)=\"\",\"\",\"P\"&VLOOKUP(P9,問題1000!$A$1:$D$1001,2,FALSE))","v":""},{"$f":"IF(VLOOKUP(Q9,問題1000!$A$1:$D$1001,2,FALSE)=\"\",\"\",\"P\"&VLOOKUP(Q9,問題1000!$A$1:$D$1001,2,FALSE))","v":"PP118"}]
[null,{"$f":"VLOOKUP(B9,問題1000!$A$1:$D$1001,3,FALSE)","v":"光村図書"},{"$f":"VLOOKUP(C9,問題1000!$A$1:$D$1001,3,FALSE)","v":"国語"},{"$f":"VLOOKUP(D9,問題1000!$A$1:$D$1001,3,FALSE)","v":"短くする"},{"$f":"VLOOKUP(E9,問題1000!$A$1:$D$1001,3,FALSE)","v":"印象づける"},{"$f":"VLOOKUP(F9,問題1000!$A$1:$D$1001,3,FALSE)","v":"文章の種類"},{"$f":"VLOOKUP(G9,問題1000!$A$1:$D$1001,3,FALSE)","v":"登場人物"},{"$f":"VLOOKUP(H9,問題1000!$A$1:$D$1001,3,FALSE)","v":"重要な言葉"},{"$f":"VLOOKUP(I9,問題1000!$A$1:$D$1001,3,FALSE)","v":"図表を使う"},{"$f":"VLOOKUP(J9,問題1000!$A$1:$D$1001,3,FALSE)","v":"飛行機"},{"$f":"VLOOKUP(K9,問題1000!$A$1:$D$1001,3,FALSE)","v":"必死"},{"$f":"VLOOKUP(L9,問題1000!$A$1:$D$1001,3,FALSE)","v":"国際交流"},{"$f":"VLOOKUP(M9,問題1000!$A$1:$D$1001,3,FALSE)","v":"他校生"},{"$f":"VLOOKUP(N9,問題1000!$A$1:$D$1001,3,FALSE)","v":"毛筆"},{"$f":"VLOOKUP(O9,問題1000!$A$1:$D$1001,3,FALSE)","v":"進級"},{"$f":"VLOOKUP(P9,問題1000!$A$1:$D$1001,3,FALSE)","v":"取り囲む"},{"$f":"VLOOKUP(Q9,問題1000!$A$1:$D$1001,3,FALSE)","v":"食堂"}]
[{"$f":"B13+1","v":967},{"$f":"C13+1","v":966},{"$f":"D13+1","v":965},{"$f":"E13+1","v":964},{"$f":"F13+1","v":963},{"$f":"G13+1","v":962},{"$f":"H13+1","v":961},{"$f":"I13+1","v":960},{"$f":"J13+1","v":959},{"$f":"K13+1","v":958},{"$f":"L13+1","v":957},{"$f":"M13+1","v":956},{"$f":"N13+1","v":955},{"$f":"O13+1","v":954},{"$f":"P13+1","v":953},{"$f":"Q13+1","v":952},{"$f":"Q1","v":951}]
[]
[{"$f":"IF(VLOOKUP(A13,問題1000!$A$1:$D$1001,2,FALSE)=\"\",\"\",\"P\"&VLOOKUP(A13,問題1000!$A$1:$D$1001,2,FALSE))","v":""},{"$f":"IF(VLOOKUP(B13,問題1000!$A$1:$D$1001,2,FALSE)=\"\",\"\",\"P\"&VLOOKUP(B13,問題1000!$A$1:$D$1001,2,FALSE))","v":""},{"$f":"IF(VLOOKUP(C13,問題1000!$A$1:$D$1001,2,FALSE)=\"\",\"\",\"P\"&VLOOKUP(C13,問題1000!$A$1:$D$1001,2,FALSE))","v":""},{"$f":"IF(VLOOKUP(D13,問題1000!$A$1:$D$1001,2,FALSE)=\"\",\"\",\"P\"&VLOOKUP(D13,問題1000!$A$1:$D$1001,2,FALSE))","v":"PP103"},{"$f":"IF(VLOOKUP(E13,問題1000!$A$1:$D$1001,2,FALSE)=\"\",\"\",\"P\"&VLOOKUP(E13,問題1000!$A$1:$D$1001,2,FALSE))","v":""},{"$f":"IF(VLOOKUP(F13,問題1000!$A$1:$D$1001,2,FALSE)=\"\",\"\",\"P\"&VLOOKUP(F13,問題1000!$A$1:$D$1001,2,FALSE))","v":""},{"$f":"IF(VLOOKUP(G13,問題1000!$A$1:$D$1001,2,FALSE)=\"\",\"\",\"P\"&VLOOKUP(G13,問題1000!$A$1:$D$1001,2,FALSE))","v":""},{"$f":"IF(VLOOKUP(H13,問題1000!$A$1:$D$1001,2,FALSE)=\"\",\"\",\"P\"&VLOOKUP(H13,問題1000!$A$1:$D$1001,2,FALSE))","v":""},{"$f":"IF(VLOOKUP(I13,問題1000!$A$1:$D$1001,2,FALSE)=\"\",\"\",\"P\"&VLOOKUP(I13,問題1000!$A$1:$D$1001,2,FALSE))","v":"PP102"},{"$f":"IF(VLOOKUP(J13,問題1000!$A$1:$D$1001,2,FALSE)=\"\",\"\",\"P\"&VLOOKUP(J13,問題1000!$A$1:$D$1001,2,FALSE))","v":""},{"$f":"IF(VLOOKUP(K13,問題1000!$A$1:$D$1001,2,FALSE)=\"\",\"\",\"P\"&VLOOKUP(K13,問題1000!$A$1:$D$1001,2,FALSE))","v":"PP100"},{"$f":"IF(VLOOKUP(L13,問題1000!$A$1:$D$1001,2,FALSE)=\"\",\"\",\"P\"&VLOOKUP(L13,問題1000!$A$1:$D$1001,2,FALSE))","v":"PP99"},{"$f":"IF(VLOOKUP(M13,問題1000!$A$1:$D$1001,2,FALSE)=\"\",\"\",\"P\"&VLOOKUP(M13,問題1000!$A$1:$D$1001,2,FALSE))","v":""},{"$f":"IF(VLOOKUP(N13,問題1000!$A$1:$D$1001,2,FALSE)=\"\",\"\",\"P\"&VLOOKUP(N13,問題1000!$A$1:$D$1001,2,FALSE))","v":""},{"$f":"IF(VLOOKUP(O13,問題1000!$A$1:$D$1001,2,FALSE)=\"\",\"\",\"P\"&VLOOKUP(O13,問題1000!$A$1:$D$1001,2,FALSE))","v":"PP97"},{"$f":"IF(VLOOKUP(P13,問題1000!$A$1:$D$1001,2,FALSE)=\"\",\"\",\"P\"&VLOOKUP(P13,問題1000!$A$1:$D$1001,2,FALSE))","v":""},{"$f":"IF(VLOOKUP(Q13,問題1000!$A$1:$D$1001,2,FALSE)=\"\",\"\",\"P\"&VLOOKUP(Q13,問題1000!$A$1:$D$1001,2,FALSE))","v":""}]
[{"$f":"VLOOKUP(A13,問題1000!$A$1:$D$1001,4,FALSE)","v":"きのこいがいたべない"},{"$f":"VLOOKUP(B13,問題1000!$A$1:$D$1001,4,FALSE)","v":"いがいなけっか"},{"$f":"VLOOKUP(C13,問題1000!$A$1:$D$1001,4,FALSE)","v":"べいさく"},{"$f":"VLOOKUP(D13,問題1000!$A$1:$D$1001,4,FALSE)","v":"やさいのりょう"},{"$f":"VLOOKUP(E13,問題1000!$A$1:$D$1001,4,FALSE)","v":"かんしんをもつ"},{"$f":"VLOOKUP(F13,問題1000!$A$1:$D$1001,4,FALSE)","v":"かんしんなおこない"},{"$f":"VLOOKUP(G13,問題1000!$A$1:$D$1001,4,FALSE)","v":"しゅげいようひん"},{"$f":"VLOOKUP(H13,問題1000!$A$1:$D$1001,4,FALSE)","v":"じをなおす"},{"$f":"VLOOKUP(I13,問題1000!$A$1:$D$1001,4,FALSE)","v":"びょうきをなおす"},{"$f":"VLOOKUP(J13,問題1000!$A$1:$D$1001,4,FALSE)","v":"くべつ"},{"$f":"VLOOKUP(K13,問題1000!$A$1:$D$1001,4,FALSE)","v":"こうか"},{"$f":"VLOOKUP(L13,問題1000!$A$1:$D$1001,4,FALSE)","v":"しくみ"},{"$f":"VLOOKUP(M13,問題1000!$A$1:$D$1001,4,FALSE)","v":"ししょ"},{"$f":"VLOOKUP(N13,問題1000!$A$1:$D$1001,4,FALSE)","v":"さんこうとしょ"},{"$f":"VLOOKUP(O13,問題1000!$A$1:$D$1001,4,FALSE)","v":"ひゃっかじてん"},{"$f":"VLOOKUP(P13,問題1000!$A$1:$D$1001,4,FALSE)","v":"かにゅうする"},{"$f":"VLOOKUP(Q13,問題1000!$A$1:$D$1001,4,FALSE)","v":"へいわをねがう"}]
[{"$f":"B17+1","v":984},{"$f":"C17+1","v":983},{"$f":"D17+1","v":982},{"$f":"E17+1","v":981},{"$f":"F17+1","v":980},{"$f":"G17+1","v":979},{"$f":"H17+1","v":978},{"$f":"I17+1","v":977},{"$f":"J17+1","v":976},{"$f":"K17+1","v":975},{"$f":"L17+1","v":974},{"$f":"M17+1","v":973},{"$f":"N17+1","v":972},{"$f":"O17+1","v":971},{"$f":"P17+1","v":970},{"$f":"Q17+1","v":969},{"$f":"A13+1","v":968}]
[]
[{"$f":"IF(VLOOKUP(A17,問題1000!$A$1:$D$1001,2,FALSE)=\"\",\"\",\"P\"&VLOOKUP(A17,問題1000!$A$1:$D$1001,2,FALSE))","v":"PP117"},{"$f":"IF(VLOOKUP(B17,問題1000!$A$1:$D$1001,2,FALSE)=\"\",\"\",\"P\"&VLOOKUP(B17,問題1000!$A$1:$D$1001,2,FALSE))","v":"PP114"},{"$f":"IF(VLOOKUP(C17,問題1000!$A$1:$D$1001,2,FALSE)=\"\",\"\",\"P\"&VLOOKUP(C17,問題1000!$A$1:$D$1001,2,FALSE))","v":"PP113"},{"$f":"IF(VLOOKUP(D17,問題1000!$A$1:$D$1001,2,FALSE)=\"\",\"\",\"P\"&VLOOKUP(D17,問題1000!$A$1:$D$1001,2,FALSE))","v":""},{"$f":"IF(VLOOKUP(E17,問題1000!$A$1:$D$1001,2,FALSE)=\"\",\"\",\"P\"&VLOOKUP(E17,問題1000!$A$1:$D$1001,2,FALSE))","v":"PP112"},{"$f":"IF(VLOOKUP(F17,問題1000!$A$1:$D$1001,2,FALSE)=\"\",\"\",\"P\"&VLOOKUP(F17,問題1000!$A$1:$D$1001,2,FALSE))","v":"PP111"},{"$f":"IF(VLOOKUP(G17,問題1000!$A$1:$D$1001,2,FALSE)=\"\",\"\",\"P\"&VLOOKUP(G17,問題1000!$A$1:$D$1001,2,FALSE))","v":""},{"$f":"IF(VLOOKUP(H17,問題1000!$A$1:$D$1001,2,FALSE)=\"\",\"\",\"P\"&VLOOKUP(H17,問題1000!$A$1:$D$1001,2,FALSE))","v":"PP109"},{"$f":"IF(VLOOKUP(I17,問題1000!$A$1:$D$1001,2,FALSE)=\"\",\"\",\"P\"&VLOOKUP(I17,問題1000!$A$1:$D$1001,2,FALSE))","v":"PP108"},{"$f":"IF(VLOOKUP(J17,問題1000!$A$1:$D$1001,2,FALSE)=\"\",\"\",\"P\"&VLOOKUP(J17,問題1000!$A$1:$D$1001,2,FALSE))","v":""},{"$f":"IF(VLOOKUP(K17,問題1000!$A$1:$D$1001,2,FALSE)=\"\",\"\",\"P\"&VLOOKUP(K17,問題1000!$A$1:$D$1001,2,FALSE))","v":""},{"$f":"IF(VLOOKUP(L17,問題1000!$A$1:$D$1001,2,FALSE)=\"\",\"\",\"P\"&VLOOKUP(L17,問題1000!$A$1:$D$1001,2,FALSE))","v":""},{"$f":"IF(VLOOKUP(M17,問題1000!$A$1:$D$1001,2,FALSE)=\"\",\"\",\"P\"&VLOOKUP(M17,問題1000!$A$1:$D$1001,2,FALSE))","v":"PP106"},{"$f":"IF(VLOOKUP(N17,問題1000!$A$1:$D$1001,2,FALSE)=\"\",\"\",\"P\"&VLOOKUP(N17,問題1000!$A$1:$D$1001,2,FALSE))","v":""},{"$f":"IF(VLOOKUP(O17,問題1000!$A$1:$D$1001,2,FALSE)=\"\",\"\",\"P\"&VLOOKUP(O17,問題1000!$A$1:$D$1001,2,FALSE))","v":""},{"$f":"IF(VLOOKUP(P17,問題1000!$A$1:$D$1001,2,FALSE)=\"\",\"\",\"P\"&VLOOKUP(P17,問題1000!$A$1:$D$1001,2,FALSE))","v":"PP105"},{"$f":"IF(VLOOKUP(Q17,問題1000!$A$1:$D$1001,2,FALSE)=\"\",\"\",\"P\"&VLOOKUP(Q17,問題1000!$A$1:$D$1001,2,FALSE))","v":"PP104"}]
[{"$f":"VLOOKUP(A17,問題1000!$A$1:$D$1001,4,FALSE)","v":"いきをすう"},{"$f":"VLOOKUP(B17,問題1000!$A$1:$D$1001,4,FALSE)","v":"くさのたね"},{"$f":"VLOOKUP(C17,問題1000!$A$1:$D$1001,4,FALSE)","v":"ひろいあげる"},{"$f":"VLOOKUP(D17,問題1000!$A$1:$D$1001,4,FALSE)","v":"くさやね"},{"$f":"VLOOKUP(E17,問題1000!$A$1:$D$1001,4,FALSE)","v":"となえる"},{"$f":"VLOOKUP(F17,問題1000!$A$1:$D$1001,4,FALSE)","v":"おひさま"},{"$f":"VLOOKUP(G17,問題1000!$A$1:$D$1001,4,FALSE)","v":"めをみひらく"},{"$f":"VLOOKUP(H17,問題1000!$A$1:$D$1001,4,FALSE)","v":"はつゆきのふるひ"},{"$f":"VLOOKUP(I17,問題1000!$A$1:$D$1001,4,FALSE)","v":"せかいのはて"},{"$f":"VLOOKUP(J17,問題1000!$A$1:$D$1001,4,FALSE)","v":"つめたいかぜ"},{"$f":"VLOOKUP(K17,問題1000!$A$1:$D$1001,4,FALSE)","v":"こなゆきがまう"},{"$f":"VLOOKUP(L17,問題1000!$A$1:$D$1001,4,FALSE)","v":"みせばんをする"},{"$f":"VLOOKUP(M17,問題1000!$A$1:$D$1001,4,FALSE)","v":"ていりゅうじょ"},{"$f":"VLOOKUP(N17,問題1000!$A$1:$D$1001,4,FALSE)","v":"とびこむ"},{"$f":"VLOOKUP(O17,問題1000!$A$1:$D$1001,4,FALSE)","v":"かるくてころがる"},{"$f":"VLOOKUP(P17,問題1000!$A$1:$D$1001,4,FALSE)","v":"まんまる"},{"$f":"VLOOKUP(Q17,問題1000!$A$1:$D$1001,4,FALSE)","v":"いっぽんみち"}]
[null,{"$f":"C21+1","v":1000},{"$f":"D21+1","v":999},{"$f":"E21+1","v":998},{"$f":"F21+1","v":997},{"$f":"G21+1","v":996},{"$f":"H21+1","v":995},{"$f":"I21+1","v":994},{"$f":"J21+1","v":993},{"$f":"K21+1","v":992},{"$f":"L21+1","v":991},{"$f":"M21+1","v":990},{"$f":"N21+1","v":989},{"$f":"O21+1","v":988},{"$f":"P21+1","v":987},{"$f":"Q21+1","v":986},{"$f":"A17+1","v":985}]
[]
[null,{"$f":"IF(VLOOKUP(B21,問題1000!$A$1:$D$1001,2,FALSE)=\"\",\"\",\"P\"&VLOOKUP(B21,問題1000!$A$1:$D$1001,2,FALSE))","v":""},{"$f":"IF(VLOOKUP(C21,問題1000!$A$1:$D$1001,2,FALSE)=\"\",\"\",\"P\"&VLOOKUP(C21,問題1000!$A$1:$D$1001,2,FALSE))","v":""},{"$f":"IF(VLOOKUP(D21,問題1000!$A$1:$D$1001,2,FALSE)=\"\",\"\",\"P\"&VLOOKUP(D21,問題1000!$A$1:$D$1001,2,FALSE))","v":""},{"$f":"IF(VLOOKUP(E21,問題1000!$A$1:$D$1001,2,FALSE)=\"\",\"\",\"P\"&VLOOKUP(E21,問題1000!$A$1:$D$1001,2,FALSE))","v":"PP129"},{"$f":"IF(VLOOKUP(F21,問題1000!$A$1:$D$1001,2,FALSE)=\"\",\"\",\"P\"&VLOOKUP(F21,問題1000!$A$1:$D$1001,2,FALSE))","v":""},{"$f":"IF(VLOOKUP(G21,問題1000!$A$1:$D$1001,2,FALSE)=\"\",\"\",\"P\"&VLOOKUP(G21,問題1000!$A$1:$D$1001,2,FALSE))","v":""},{"$f":"IF(VLOOKUP(H21,問題1000!$A$1:$D$1001,2,FALSE)=\"\",\"\",\"P\"&VLOOKUP(H21,問題1000!$A$1:$D$1001,2,FALSE))","v":"PP128"},{"$f":"IF(VLOOKUP(I21,問題1000!$A$1:$D$1001,2,FALSE)=\"\",\"\",\"P\"&VLOOKUP(I21,問題1000!$A$1:$D$1001,2,FALSE))","v":"PP127"},{"$f":"IF(VLOOKUP(J21,問題1000!$A$1:$D$1001,2,FALSE)=\"\",\"\",\"P\"&VLOOKUP(J21,問題1000!$A$1:$D$1001,2,FALSE))","v":"PP124"},{"$f":"IF(VLOOKUP(K21,問題1000!$A$1:$D$1001,2,FALSE)=\"\",\"\",\"P\"&VLOOKUP(K21,問題1000!$A$1:$D$1001,2,FALSE))","v":""},{"$f":"IF(VLOOKUP(L21,問題1000!$A$1:$D$1001,2,FALSE)=\"\",\"\",\"P\"&VLOOKUP(L21,問題1000!$A$1:$D$1001,2,FALSE))","v":""},{"$f":"IF(VLOOKUP(M21,問題1000!$A$1:$D$1001,2,FALSE)=\"\",\"\",\"P\"&VLOOKUP(M21,問題1000!$A$1:$D$1001,2,FALSE))","v":""},{"$f":"IF(VLOOKUP(N21,問題1000!$A$1:$D$1001,2,FALSE)=\"\",\"\",\"P\"&VLOOKUP(N21,問題1000!$A$1:$D$1001,2,FALSE))","v":""},{"$f":"IF(VLOOKUP(O21,問題1000!$A$1:$D$1001,2,FALSE)=\"\",\"\",\"P\"&VLOOKUP(O21,問題1000!$A$1:$D$1001,2,FALSE))","v":"PP123"},{"$f":"IF(VLOOKUP(P21,問題1000!$A$1:$D$1001,2,FALSE)=\"\",\"\",\"P\"&VLOOKUP(P21,問題1000!$A$1:$D$1001,2,FALSE))","v":""},{"$f":"IF(VLOOKUP(Q21,問題1000!$A$1:$D$1001,2,FALSE)=\"\",\"\",\"P\"&VLOOKUP(Q21,問題1000!$A$1:$D$1001,2,FALSE))","v":"PP118"}]
[null,{"$f":"VLOOKUP(B21,問題1000!$A$1:$D$1001,4,FALSE)","v":"みつむらとしょ"},{"$f":"VLOOKUP(C21,問題1000!$A$1:$D$1001,4,FALSE)","v":"こくご"},{"$f":"VLOOKUP(D21,問題1000!$A$1:$D$1001,4,FALSE)","v":"みじかくする"},{"$f":"VLOOKUP(E21,問題1000!$A$1:$D$1001,4,FALSE)","v":"いんしょうづける"},{"$f":"VLOOKUP(F21,問題1000!$A$1:$D$1001,4,FALSE)","v":"ぶんしょうのしゅるい"},{"$f":"VLOOKUP(G21,問題1000!$A$1:$D$1001,4,FALSE)","v":"とうじょうじんぶつ"},{"$f":"VLOOKUP(H21,問題1000!$A$1:$D$1001,4,FALSE)","v":"じゅうようなことば"},{"$f":"VLOOKUP(I21,問題1000!$A$1:$D$1001,4,FALSE)","v":"ずひょうをつかう"},{"$f":"VLOOKUP(J21,問題1000!$A$1:$D$1001,4,FALSE)","v":"ひこうき"},{"$f":"VLOOKUP(K21,問題1000!$A$1:$D$1001,4,FALSE)","v":"ひっし"},{"$f":"VLOOKUP(L21,問題1000!$A$1:$D$1001,4,FALSE)","v":"こくさいこうりゅう"},{"$f":"VLOOKUP(M21,問題1000!$A$1:$D$1001,4,FALSE)","v":"たこうせい"},{"$f":"VLOOKUP(N21,問題1000!$A$1:$D$1001,4,FALSE)","v":"もうひつ"},{"$f":"VLOOKUP(O21,問題1000!$A$1:$D$1001,4,FALSE)","v":"しんきゅう"},{"$f":"VLOOKUP(P21,問題1000!$A$1:$D$1001,4,FALSE)","v":"とりかこむ"},{"$f":"VLOOKUP(Q21,問題1000!$A$1:$D$1001,4,FALSE)","v":"しょくどう"}]

{"sheet":"Sheet3","index":2,"n_rows":0,"n_cols":0,"rows_kept":0,"cut":false,"hidden":false,"merged":[]}