{"text_format":"1","workbook":"xlsx","n_sheets":3,"sheets":["問題1000","問題印刷","Sheet3"],"not_rendered":{"charts":0,"images":0,"macros":1,"external_links":0,"defined_names":1,"comments":0,"pivot_tables":0},"unopened":[],"bounds":{"document_bytes":16777216,"sheet_cells":100000,"rows_first":2000,"rows_last":500,"rows_between":2000,"halvings":0,"cell_chars":16384,"cell_head_chars":4096},"cells_cut":0,"cells_raw":0,"read":"whole","date_system":"1900"}

{"sheet":"問題1000","index":0,"n_rows":1338,"n_cols":4,"rows_kept":1338,"cut":false,"hidden":false,"merged":[]}
[]
[1,"P8","運動","うんどう"]
[2,"P9","相談","そうだん"]
[3,null,"正解","せいかい"]
[4,null,"名前","なまえ"]
[5,"P12","乗せる","のせる"]
[6,null,"信号","しんごう"]
[7,null,"夏みかん","なつみかん"]
[8,null,"運転手","うんてんしゅ"]
[9,"P13","暑い日","あついひ"]
[10,null,"速達",{"$f":"PHONETIC(C11)","v":"そくたつ"}]
[11,null,"送る",{"$f":"PHONETIC(C12)","v":"おくる"}]
[12,null,"大通り","おおどおり"]
[13,null,"曲がる","まがる"]
[14,null,"細い","ほそい"]
[15,"P14","車道","しゃどう"]
[16,null,"飛び出す","とびだす"]
[17,"P15","高くまい上がる","たかくまいあがる"]
[18,null,"ため息","ためいき"]
[19,null,"横を通る","よこをとおる"]
[20,null,"急いでもどる","いそいでもどる"]
[21,null,"運転席","うんてんせき"]
[22,"P16","辺りを見る","あたりをみる"]
[23,null,"見事な色","みごとないろ"]
[24,null,"四角い建物","しかくいたてもの"]
[25,null,"つかれた声","つかれたこえ"]
[26,"P17","菜の花横町","なのはなよこちょう"]
[27,null,"菜の花橋","なのはなばし"]
[28,null,"元気そう","げんきそう"]
[29,null,"遠くから","とおくから"]
[30,null,"水色","みずいろ"]
[31,"P18","客席","きゃくせき"]
[32,null,"流れる","ながれる"]
[33,null,"男の子の顔","おとこのこのかお"]
[34,"P19","ふり返る","ふりかえる"]
[35,null,"外を見る","そとをみる"]
[36,"P20","団地","だんち"]
[37,null,"野原","のはら"]
[38,null,"青々","あおあお"]
[39,null,"わた毛","わたげ"]
[40,null,"小さな声","ちいさなこえ"]
[41,"P22","印象","いんしょう"]
[42,null,"会話","かいわ"]
[43,null,"理由","りゆう"]
[44,null,"友達","ともだち"]
[45,"P24","登場人物","とうじょうじんぶつ"]
[46,null,"受ける","うける"]
[47,null,"深まる","ふかまる"]
[48,null,"地の文","じのぶん"]
[49,null,"始まる","はじまる"]
[50,"P25","場面","ばめん"]
[51,"P26","漢字","かんじ"]
[52,null,"意味","いみ"]
[53,null,"花火","はなび"]
[54,null,"開花","かいか"]
[55,null,"野菜","やさい"]
[56,null,"目薬","めぐすり"]
[57,null,"胃腸薬","いちょうやく"]
[58,null,"家路","いえじ"]
[59,null,"家庭菜園","かていさいえん"]
[60,null,"安らか","やすらか"]
[61,null,"安全安心","あんぜんあんしん"]
[62,null,"絵筆","えふで"]
[63,null,"毛筆","もうひつ"]
[64,null,"木箱","きばこ"]
[65,null,"箱庭","はこにわ"]
[66,null,"雨雲","あまぐも"]
[67,null,"雲海","うんかい"]
[68,null,"雪国","ゆきぐに"]
[69,null,"新雪","しんせつ"]
[70,"P27","悪者","わるもの"]
[71,null,"悪事","あくじ"]
[72,null,"決意","けつい"]
[73,null,"共感","きょうかん"]
[74,null,"日照り","ひでり"]
[75,null,"照明",{"$f":"PHONETIC(C76)","v":"しょうめい"}]
[76,null,"遠出","とおで"]
[77,null,"遠足","えんそく"]
[78,null,"近道","ちかみち"]
[79,null,"近景と遠景","きんけいとえんけい"]
[80,null,"熱いお湯","あついおゆ"]
[81,null,"発熱","はつねつ"]
[82,null,"通り道","とおりみち"]
[83,null,"通学路","つうがくろ"]
[84,null,"府立高校","ふりつこうこう"]
[85,null,"京都府","きょうとふ"]
[86,null,"広場","ひろば"]
[87,null,"広告","こうこく"]
[88,null,"店先","みせさき"]
[89,null,"商店街","しょうてんがい"]
[90,null,"図書室","としょしつ"]
[91,null,"図面","ずめん"]
[92,null,"田園","でんえん"]
[93,null,"公園","こうえん"]
[94,null,"島国","しまぐに"]
[95,null,"外国","がいこく"]
[96,null,"海開き","うみびらき"]
[97,null,"開始","かいし"]
[98,null,"関所","せきしょ"]
[99,null,"関係","かんけい"]
[100,null,"間近","まぢか"]
[101,null,"期間","きかん"]
[102,null,"植物","しょくぶつ"]
[103,null,"題名","だいめい"]
[104,null,"決める","きめる"]
[105,null,"図書係","としょがかり"]
[106,null,"幸い","さいわい"]
[107,null,"何度も聞く","なんどもきく"]
[108,null,"実験","じっけん"]
[109,null,"重ねる","かさねる"]
[110,null,"調子","ちょうし"]
[111,null,"整える","ととのえる"]
[112,null,"役立つ","やくだつ"]
[113,null,"時代の変化","じだいのへんか"]
[114,null,"化石","かせき"]
[115,null,"身動き","みうごき"]
[116,null,"全くない","まったくない"]
[117,null,"表通り","おもてどおり"]
[118,null,"取材","しゅざい"]
[119,null,"放送委員","ほうそういいん"]
[120,null,"旅をする","たびをする"]
[121,null,"作業時間","さぎょうじかん"]
[122,null,"病院","びょういん"]
[123,null,"合流","ごうりゅう"]
[124,null,"高速道路","こうそくどうろ"]
[125,null,"空港へ向かう","くうこうへむかう"]
[126,null,"読書感想文","どくしょかんそうぶん"]
[127,null,"洋服","ようふく"]
[128,null,"気を配る","きをくばる"]
[129,null,"白組が勝つ","しろぐみがかつ"]
[130,null,"商売の相談","しょうばいのそうだん"]
[131,"P29","漢字辞典","かんじじてん"]
[132,null,"成り立ち","なりたち"]
[133,null,"画数","かくすう"]
[134,null,"語句","ごく"]
[135,null,"音訓さくいん","おんくんさくいん"]
[136,null,"部首さくいん","ぶしゅさくいん"]
[137,null,"総画さくいん","そうかくさくいん"]
[138,null,"分類する","ぶんるいする"]
[139,null,"筆順に気をつける",{"$f":"PHONETIC(C140)","v":"ひつじゅんにきをつける"}]
[140,"P30","五十音順","ごじゅうおんじゅん"]
[141,"P31","東西南北","とうざいなんぼく"]
[142,null,"お社","おやしろ"]
[143,null,"愛読書","あいどくしょ"]
[144,null,"デヴィ夫人","デヴィふじん"]
[145,null,"昨夜","さくや"]
[146,null,"本を正す","もとをただす"]
[147,null,"青年","せいねん"]
[148,null,"灯台の近く","とうだいのちかく"]
[149,"P32","手帳","てちょう"]
[150,null,"木の芽","きのめ"]
[151,null,"若草物語","わかくさものがたり"]
[152,null,"茶畑","ちゃばたけ"]
[153,null,"茶所","ちゃどころ"]
[154,null,"新茶の季節","しんちゃのきせつ"]
[155,null,"立春","りっしゅん"]
[156,null,"立秋","りっしゅう"]
[157,"P34","司会","しかい"]
[158,null,"管理","かんり"]
[159,null,"議題","ぎだい"]
[160,null,"提案","ていあん"]
[161,null,"参加者","さんかしゃ"]
[162,null,"目的","もくてき"]
[163,null,"書記","しょき"]
[164,null,"時間配分","じかんはいぶん"]
[165,null,"学級新聞","がっきゅうしんぶん"]
[166,null,"予定どおり","よていどおり"]
[167,"P37","結果","けっか"]
[168,null,"工夫する","くふうする"]
[169,null,"明らか","あきらか"]
[170,"P38","返事","へんじ"]
[171,null,"受け止め方","うけとめかた"]
[172,"P40","筋肉","きんにく"]
[173,null,"選手","せんしゅ"]
[174,"P41","強い力","つよいちから"]
[175,null,"大切","たいせつ"]
[176,null,"同時","どうじ"]
[177,null,"説明文","せつめいぶん"]
[178,null,"深い関係","ふかいかんけい"]
[179,"P42","成功","せいこう"]
[180,null,"失敗","しっぱい"]
[181,null,"最高","さいこう"]
[182,null,"陸上","りくじょう"]
[183,null,"経験","けいけん"]
[184,null,"方法","ほうほう"]
[185,null,"楽になる","らくになる"]
[186,"P43","記録する","きろくする"]
[187,null,"必ずしも","かならずしも"]
[188,null,"苦しくなる","くるしくなる"]
[189,null,"高校生","こうこうせい"]
[190,null,"当時","とうじ"]
[191,null,"毎日","まいにち"]
[192,null,"動作","どうさ"]
[193,"P44","必要","ひつよう"]
[194,null,"無意識","むいしき"]
[195,"P45","発見","はっけん"]
[196,null,"前に進む","まえにすすむ"]
[197,null,"下り坂","くだりざか"]
[198,"P46","重要","じゅうよう"]
[199,null,"両手","りょうて"]
{"$rows_left_out":1139}
{"sheet":"問題印刷","index":1,"n_rows":24,"n_cols":22,"rows_kept":24,"cut":false,"hidden":false,"merged":[]}
[{"$f":"B1+1","v":967},{"$f":"C1+1","v":966},{"$f":"D1+1","v":965},{"$f":"E1+1","v":964},963,962,961,960,959,958,957,956,955,954,953,{"$f":"Q1+1","v":952},951,null,null,1,"から",1000]
[]
[{"$f":"IF(VLOOKUP(A1,問題1000!$A$1:$D$1001,2,FALSE)=\"\",\"\",\"P\"&VLOOKUP(A1,問題1000!$A$1:$D$1001,2,FALSE))","v":""},{"$f":"IF(VLOOKUP(B1,問題1000!$A$1:$D$1001,2,FALSE)=\"\",\"\",\"P\"&VLOOKUP(B1,問題1000!$A$1:$D$1001,2,FALSE))","v":""},{"$f":"IF(VLOOKUP(C1,問題1000!$A$1:$D$1001,2,FALSE)=\"\",\"\",\"P\"&VLOOKUP(C1,問題1000!$A$1:$D$1001,2,FALSE))","v":""},{"$f":"IF(VLOOKUP(D1,問題1000!$A$1:$D$1001,2,FALSE)=\"\",\"\",\"P\"&VLOOKUP(D1,問題1000!$A$1:$D$1001,2,FALSE))","v":"PP103"},{"$f":"IF(VLOOKUP(E1,問題1000!$A$1:$D$1001,2,FALSE)=\"\",\"\",\"P\"&VLOOKUP(E1,問題1000!$A$1:$D$1001,2,FALSE))","v":""},{"$f":"IF(VLOOKUP(F1,問題1000!$A$1:$D$1001,2,FALSE)=\"\",\"\",\"P\"&VLOOKUP(F1,問題1000!$A$1:$D$1001,2,FALSE))","v":""},{"$f":"IF(VLOOKUP(G1,問題1000!$A$1:$D$1001,2,FALSE)=\"\",\"\",\"P\"&VLOOKUP(G1,問題1000!$A$1:$D$1001,2,FALSE))","v":""},{"$f":"IF(VLOOKUP(H1,問題1000!$A$1:$D$1001,2,FALSE)=\"\",\"\",\"P\"&VLOOKUP(H1,問題1000!$A$1:$D$1001,2,FALSE))","v":""},{"$f":"IF(VLOOKUP(I1,問題1000!$A$1:$D$1001,2,FALSE)=\"\",\"\",\"P\"&VLOOKUP(I1,問題1000!$A$1:$D$1001,2,FALSE))","v":"PP102"},{"$f":"IF(VLOOKUP(J1,問題1000!$A$1:$D$1001,2,FALSE)=\"\",\"\",\"P\"&VLOOKUP(J1,問題1000!$A$1:$D$1001,2,FALSE))","v":""},{"$f":"IF(VLOOKUP(K1,問題1000!$A$1:$D$1001,2,FALSE)=\"\",\"\",\"P\"&VLOOKUP(K1,問題1000!$A$1:$D$1001,2,FALSE))","v":"PP100"},{"$f":"IF(VLOOKUP(L1,問題1000!$A$1:$D$1001,2,FALSE)=\"\",\"\",\"P\"&VLOOKUP(L1,問題1000!$A$1:$D$1001,2,FALSE))","v":"PP99"},{"$f":"IF(VLOOKUP(M1,問題1000!$A$1:$D$1001,2,FALSE)=\"\",\"\",\"P\"&VLOOKUP(M1,問題1000!$A$1:$D$1001,2,FALSE))","v":""},{"$f":"IF(VLOOKUP(N1,問題1000!$A$1:$D$1001,2,FALSE)=\"\",\"\",\"P\"&VLOOKUP(N1,問題1000!$A$1:$D$1001,2,FALSE))","v":""},{"$f":"IF(VLOOKUP(O1,問題1000!$A$1:$D$1001,2,FALSE)=\"\",\"\",\"P\"&VLOOKUP(O1,問題1000!$A$1:$D$1001,2,FALSE))","v":"PP97"},{"$f":"IF(VLOOKUP(P1,問題1000!$A$1:$D$1001,2,FALSE)=\"\",\"\",\"P\"&VLOOKUP(P1,問題1000!$A$1:$D$1001,2,FALSE))","v":""},{"$f":"IF(VLOOKUP(Q1,問題1000!$A$1:$D$1001,2,FALSE)=\"\",\"\",\"P\"&VLOOKUP(Q1,問題1000!$A$1:$D$1001,2,FALSE))","v":""}]
[{"$f":"VLOOKUP(A1,問題1000!$A$1:$D$1001,3,FALSE)","v":"きのこ以外食べない"},{"$f":"VLOOKUP(B1,問題1000!$A$1:$D$1001,3,FALSE)","v":"意外な結果"},{"$f":"VLOOKUP(C1,問題1000!$A$1:$D$1001,3,FALSE)","v":"米作"},{"$f":"VLOOKUP(D1,問題1000!$A$1:$D$1001,3,FALSE)","v":"野菜の量"},{"$f":"VLOOKUP(E1,問題1000!$A$1:$D$1001,3,FALSE)","v":"関心をもつ"},{"$f":"VLOOKUP(F1,問題1000!$A$1:$D$1001,3,FALSE)","v":"感心な行い"},{"$f":"VLOOKUP(G1,問題1000!$A$1:$D$1001,3,FALSE)","v":"手芸用品"},{"$f":"VLOOKUP(H1,問題1000!$A$1:$D$1001,3,FALSE)","v":"字を直す"},{"$f":"VLOOKUP(I1,問題1000!$A$1:$D$1001,3,FALSE)","v":"病気を治す"},{"$f":"VLOOKUP(J1,問題1000!$A$1:$D$1001,3,FALSE)","v":"区別"},{"$f":"VLOOKUP(K1,問題1000!$A$1:$D$1001,3,FALSE)","v":"硬貨"},{"$f":"VLOOKUP(L1,問題1000!$A$1:$D$1001,3,FALSE)","v":"仕組み"},{"$f":"VLOOKUP(M1,問題1000!$A$1:$D$1001,3,FALSE)","v":"司書"},{"$f":"VLOOKUP(N1,問題1000!$A$1:$D$1001,3,FALSE)","v":"参考図書"},{"$f":"VLOOKUP(O1,問題1000!$A$1:$D$1001,3,FALSE)","v":"百科事典"},{"$f":"VLOOKUP(P1,問題1000!$A$1:$D$1001,3,FALSE)","v":"加入する"},{"$f":"VLOOKUP(Q1,問題1000!$A$1:$D$1001,3,FALSE)","v":"平和を願う"}]
[{"$f":"B5+1","v":984},{"$f":"C5+1","v":983},{"$f":"D5+1","v":982},981,980,979,978,977,976,975,974,973,972,971,970,{"$f":"Q5+1","v":969},{"$f":"A1+1","v":968}]
[]
[{"$f":"IF(VLOOKUP(A5,問題1000!$A$1:$D$1001,2,FALSE)=\"\",\"\",\"P\"&VLOOKUP(A5,問題1000!$A$1:$D$1001,2,FALSE))","v":"PP117"},{"$f":"IF(VLOOKUP(B5,問題1000!$A$1:$D$1001,2,FALSE)=\"\",\"\",\"P\"&VLOOKUP(B5,問題1000!$A$1:$D$1001,2,FALSE))","v":"PP114"},{"$f":"IF(VLOOKUP(C5,問題1000!$A$1:$D$1001,2,FALSE)=\"\",\"\",\"P\"&VLOOKUP(C5,問題1000!$A$1:$D$1001,2,FALSE))","v":"PP113"},{"$f":"IF(VLOOKUP(D5,問題1000!$A$1:$D$1001,2,FALSE)=\"\",\"\",\"P\"&VLOOKUP(D5,問題1000!$A$1:$D$1001,2,FALSE))","v":""},{"$f":"IF(VLOOKUP(E5,問題1000!$A$1:$D$1001,2,FALSE)=\"\",\"\",\"P\"&VLOOKUP(E5,問題1000!$A$1:$D$1001,2,FALSE))","v":"PP112"},{"$f":"IF(VLOOKUP(F5,問題1000!$A$1:$D$1001,2,FALSE)=\"\",\"\",\"P\"&VLOOKUP(F5,問題1000!$A$1:$D$1001,2,FALSE))","v":"PP111"},{"$f":"IF(VLOOKUP(G5,問題1000!$A$1:$D$1001,2,FALSE)=\"\",\"\",\"P\"&VLOOKUP(G5,問題1000!$A$1:$D$1001,2,FALSE))","v":""},{"$f":"IF(VLOOKUP(H5,問題1000!$A$1:$D$1001,2,FALSE)=\"\",\"\",\"P\"&VLOOKUP(H5,問題1000!$A$1:$D$1001,2,FALSE))","v":"PP109"},{"$f":"IF(VLOOKUP(I5,問題1000!$A$1:$D$1001,2,FALSE)=\"\",\"\",\"P\"&VLOOKUP(I5,問題1000!$A$1:$D$1001,2,FALSE))","v":"PP108"},{"$f":"IF(VLOOKUP(J5,問題1000!$A$1:$D$1001,2,FALSE)=\"\",\"\",\"P\"&VLOOKUP(J5,問題1000!$A$1:$D$1001,2,FALSE))","v":""},{"$f":"IF(VLOOKUP(K5,問題1000!$A$1:$D$1001,2,FALSE)=\"\",\"\",\"P\"&VLOOKUP(K5,問題1000!$A$1:$D$1001,2,FALSE))","v":""},{"$f":"IF(VLOOKUP(L5,問題1000!$A$1:$D$1001,2,FALSE)=\"\",\"\",\"P\"&VLOOKUP(L5,問題1000!$A$1:$D$1001,2,FALSE))","v":""},{"$f":"IF(VLOOKUP(M5,問題1000!$A$1:$D$1001,2,FALSE)=\"\",\"\",\"P\"&VLOOKUP(M5,問題1000!$A$1:$D$1001,2,FALSE))","v":"PP106"},{"$f":"IF(VLOOKUP(N5,問題1000!$A$1:$D$1001,2,FALSE)=\"\",\"\",\"P\"&VLOOKUP(N5,問題1000!$A$1:$D$1001,2,FALSE))","v":""},{"$f":"IF(VLOOKUP(O5,問題1000!$A$1:$D$1001,2,FALSE)=\"\",\"\",\"P\"&VLOOKUP(O5,問題1000!$A$1:$D$1001,2,FALSE))","v":""},{"$f":"IF(VLOOKUP(P5,問題1000!$A$1:$D$1001,2,FALSE)=\"\",\"\",\"P\"&VLOOKUP(P5,問題1000!$A$1:$D$1001,2,FALSE))","v":"PP105"},{"$f":"IF(VLOOKUP(Q5,問題1000!$A$1:$D$1001,2,FALSE)=\"\",\"\",\"P\"&VLOOKUP(Q5,問題1000!$A$1:$D$1001,2,FALSE))","v":"PP104"}]
[{"$f":"VLOOKUP(A5,問題1000!$A$1:$D$1001,3,FALSE)","v":"息をすう"},{"$f":"VLOOKUP(B5,問題1000!$A$1:$D$1001,3,FALSE)","v":"草の種"},{"$f":"VLOOKUP(C5,問題1000!$A$1:$D$1001,3,FALSE)","v":"拾い上げる"},{"$f":"VLOOKUP(D5,問題1000!$A$1:$D$1001,3,FALSE)","v":"草屋根"},{"$f":"VLOOKUP(E5,問題1000!$A$1:$D$1001,3,FALSE)","v":"唱える"},{"$f":"VLOOKUP(F5,問題1000!$A$1:$D$1001,3,FALSE)","v":"お日様"},{"$f":"VLOOKUP(G5,問題1000!$A$1:$D$1001,3,FALSE)","v":"目を見開く"},{"$f":"VLOOKUP(H5,問題1000!$A$1:$D$1001,3,FALSE)","v":"初雪の降る日"},{"$f":"VLOOKUP(I5,問題1000!$A$1:$D$1001,3,FALSE)","v":"世界の果て"},{"$f":"VLOOKUP(J5,問題1000!$A$1:$D$1001,3,FALSE)","v":"冷たい風"},{"$f":"VLOOKUP(K5,問題1000!$A$1:$D$1001,3,FALSE)","v":"粉雪がまう"},{"$f":"VLOOKUP(L5,問題1000!$A$1:$D$1001,3,FALSE)","v":"店番をする"},{"$f":"VLOOKUP(M5,問題1000!$A$1:$D$1001,3,FALSE)","v":"停留所"},{"$f":"VLOOKUP(N5,問題1000!$A$1:$D$1001,3,FALSE)","v":"飛び込む"},{"$f":"VLOOKUP(O5,問題1000!$A$1:$D$1001,3,FALSE)","v":"軽くて転がる"},{"$f":"VLOOKUP(P5,問題1000!$A$1:$D$1001,3,FALSE)","v":"真ん丸"},{"$f":"VLOOKUP(Q5,問題1000!$A$1:$D$1001,3,FALSE)","v":"一本道"}]
[null,{"$f":"C9+1","v":1000},{"$f":"D9+1","v":999},998,997,996,995,994,993,992,991,990,989,988,987,{"$f":"Q9+1","v":986},{"$f":"A5+1","v":985}]
[]
[null,{"$f":"IF(VLOOKUP(B9,問題1000!$A$1:$D$1001,2,FALSE)=\"\",\"\",\"P\"&VLOOKUP(B9,問題1000!$A$1:$D$1001,2,FALSE))","v":""},{"$f":"IF(VLOOKUP(C9,問題1000!$A$1:$D$1001,2,FALSE)=\"\",\"\",\"P\"&VLOOKUP(C9,問題1000!$A$1:$D$1001,2,FALSE))","v":""},{"$f":"IF(VLOOKUP(D9,問題1000!$A$1:$D$1001,2,FALSE)=\"\",\"\",\"P\"&VLOOKUP(D9,問題1000!$A$1:$D$1001,2,FALSE))","v":""},{"$f":"IF(VLOOKUP(E9,問題1000!$A$1:$D$1001,2,FALSE)=\"\",\"\",\"P\"&VLOOKUP(E9,問題1000!$A$1:$D$1001,2,FALSE))","v":"PP129"},{"$f":"IF(VLOOKUP(F9,問題1000!$A$1:$D$1001,2,FALSE)=\"\",\"\",\"P\"&VLOOKUP(F9,問題1000!$A$1:$D$1001,2,FALSE))","v":""},{"$f":"IF(VLOOKUP(G9,問題1000!$A$1:$D$1001,2,FALSE)=\"\",\"\",\"P\"&VLOOKUP(G9,問題1000!$A$1:$D$1001,2,FALSE))","v":""},{"$f":"IF(VLOOKUP(H9,問題1000!$A$1:$D$1001,2,FALSE)=\"\",\"\",\"P\"&VLOOKUP(H9,問題1000!$A$1:$D$1001,2,FALSE))","v":"PP128"},{"$f":"IF(VLOOKUP(I9,問題1000!$A$1:$D$1001,2,FALSE)=\"\",\"\",\"P\"&VLOOKUP(I9,問題1000!$A$1:$D$1001,2,FALSE))","v":"PP127"},{"$f":"IF(VLOOKUP(J9,問題1000!$A$1:$D$1001,2,FALSE)=\"\",\"\",\"P\"&VLOOKUP(J9,問題1000!$A$1:$D$1001,2,FALSE))","v":"PP124"},{"$f":"IF(VLOOKUP(K9,問題1000!$A$1:$D$1001,2,FALSE)=\"\",\"\",\"P\"&VLOOKUP(K9,問題1000!$A$1:$D$1001,2,FALSE))","v":""},{"$f":"IF(VLOOKUP(L9,問題1000!$A$1:$D$1001,2,FALSE)=\"\",\"\",\"P\"&VLOOKUP(L9,問題1000!$A$1:$D$1001,2,FALSE))","v":""},{"$f":"IF(VLOOKUP(M9,問題1000!$A$1:$D$1001,2,FALSE)=\"\",\"\",\"P\"&VLOOKUP(M9,問題1000!$A$1:$D$1001,2,FALSE))","v":""},{"$f":"IF(VLOOKUP(N9,問題1000!$A$1:$D$1001,2,FALSE)=\"\",\"\",\"P\"&VLOOKUP(N9,問題1000!$A$1:$D$1001,2,FALSE))","v":""},{"$f":"IF(VLOOKUP(O9,問題1000!$A$1:$D$1001,2,FALSE)=\"\",\"\",\"P\"&VLOOKUP(O9,問題1000!$A$1:$D$1001,2,FALSE))","v":"PP123"},{"$f":"IF(VLOOKUP(P9,問題1000!$A$1:$D$1001,2,FALSE)=\"\",\"\",\"P\"&VLOOKUP(P9,問題1000!$A$1:$D$1001,2,FALSE))","v":""},{"$f":"IF(VLOOKUP(Q9,問題1000!$A$1:$D$1001,2,FALSE)=\"\",\"\",\"P\"&VLOOKUP(Q9,問題1000!$A$1:$D$1001,2,FALSE))","v":"PP118"}]
[null,{"$f":"VLOOKUP(B9,問題1000!$A$1:$D$1001,3,FALSE)","v":"光村図書"},{"$f":"VLOOKUP(C9,問題1000!$A$1:$D$1001,3,FALSE)","v":"国語"},{"$f":"VLOOKUP(D9,問題1000!$A$1:$D$1001,3,FALSE)","v":"短くする"},{"$f":"VLOOKUP(E9,問題1000!$A$1:$D$1001,3,FALSE)","v":"印象づける"},{"$f":"VLOOKUP(F9,問題1000!$A$1:$D$1001,3,FALSE)","v":"文章の種類"},{"$f":"VLOOKUP(G9,問題1000!$A$1:$D$1001,3,FALSE)","v":"登場人物"},{"$f":"VLOOKUP(H9,問題1000!$A$1:$D$1001,3,FALSE)","v":"重要な言葉"},{"$f":"VLOOKUP(I9,問題1000!$A$1:$D$1001,3,FALSE)","v":"図表を使う"},{"$f":"VLOOKUP(J9,問題1000!$A$1:$D$1001,3,FALSE)","v":"飛行機"},{"$f":"VLOOKUP(K9,問題1000!$A$1:$D$1001,3,FALSE)","v":"必死"},{"$f":"VLOOKUP(L9,問題1000!$A$1:$D$1001,3,FALSE)","v":"国際交流"},{"$f":"VLOOKUP(M9,問題1000!$A$1:$D$1001,3,FALSE)","v":"他校生"},{"$f":"VLOOKUP(N9,問題1000!$A$1:$D$1001,3,FALSE)","v":"毛筆"},{"$f":"VLOOKUP(O9,問題1000!$A$1:$D$1001,3,FALSE)","v":"進級"},{"$f":"VLOOKUP(P9,問題1000!$A$1:$D$1001,3,FALSE)","v":"取り囲む"},{"$f":"VLOOKUP(Q9,問題1000!$A$1:$D$1001,3,FALSE)","v":"食堂"}]
[{"$f":"B13+1","v":967},{"$f":"C13+1","v":966},{"$f":"D13+1","v":965},{"$f":"E13+1","v":964},{"$f":"F13+1","v":963},{"$f":"G13+1","v":962},{"$f":"H13+1","v":961},{"$f":"I13+1","v":960},{"$f":"J13+1","v":959},{"$f":"K13+1","v":958},{"$f":"L13+1","v":957},{"$f":"M13+1","v":956},{"$f":"N13+1","v":955},{"$f":"O13+1","v":954},{"$f":"P13+1","v":953},{"$f":"Q13+1","v":952},{"$f":"Q1","v":951}]
[]
[{"$f":"IF(VLOOKUP(A13,問題1000!$A$1:$D$1001,2,FALSE)=\"\",\"\",\"P\"&VLOOKUP(A13,問題1000!$A$1:$D$1001,2,FALSE))","v":""},{"$f":"IF(VLOOKUP(B13,問題1000!$A$1:$D$1001,2,FALSE)=\"\",\"\",\"P\"&VLOOKUP(B13,問題1000!$A$1:$D$1001,2,FALSE))","v":""},{"$f":"IF(VLOOKUP(C13,問題1000!$A$1:$D$1001,2,FALSE)=\"\",\"\",\"P\"&VLOOKUP(C13,問題1000!$A$1:$D$1001,2,FALSE))","v":""},{"$f":"IF(VLOOKUP(D13,問題1000!$A$1:$D$1001,2,FALSE)=\"\",\"\",\"P\"&VLOOKUP(D13,問題1000!$A$1:$D$1001,2,FALSE))","v":"PP103"},{"$f":"IF(VLOOKUP(E13,問題1000!$A$1:$D$1001,2,FALSE)=\"\",\"\",\"P\"&VLOOKUP(E13,問題1000!$A$1:$D$1001,2,FALSE))","v":""},{"$f":"IF(VLOOKUP(F13,問題1000!$A$1:$D$1001,2,FALSE)=\"\",\"\",\"P\"&VLOOKUP(F13,問題1000!$A$1:$D$1001,2,FALSE))","v":""},{"$f":"IF(VLOOKUP(G13,問題1000!$A$1:$D$1001,2,FALSE)=\"\",\"\",\"P\"&VLOOKUP(G13,問題1000!$A$1:$D$1001,2,FALSE))","v":""},{"$f":"IF(VLOOKUP(H13,問題1000!$A$1:$D$1001,2,FALSE)=\"\",\"\",\"P\"&VLOOKUP(H13,問題1000!$A$1:$D$1001,2,FALSE))","v":""},{"$f":"IF(VLOOKUP(I13,問題1000!$A$1:$D$1001,2,FALSE)=\"\",\"\",\"P\"&VLOOKUP(I13,問題1000!$A$1:$D$1001,2,FALSE))","v":"PP102"},{"$f":"IF(VLOOKUP(J13,問題1000!$A$1:$D$1001,2,FALSE)=\"\",\"\",\"P\"&VLOOKUP(J13,問題1000!$A$1:$D$1001,2,FALSE))","v":""},{"$f":"IF(VLOOKUP(K13,問題1000!$A$1:$D$1001,2,FALSE)=\"\",\"\",\"P\"&VLOOKUP(K13,問題1000!$A$1:$D$1001,2,FALSE))","v":"PP100"},{"$f":"IF(VLOOKUP(L13,問題1000!$A$1:$D$1001,2,FALSE)=\"\",\"\",\"P\"&VLOOKUP(L13,問題1000!$A$1:$D$1001,2,FALSE))","v":"PP99"},{"$f":"IF(VLOOKUP(M13,問題1000!$A$1:$D$1001,2,FALSE)=\"\",\"\",\"P\"&VLOOKUP(M13,問題1000!$A$1:$D$1001,2,FALSE))","v":""},{"$f":"IF(VLOOKUP(N13,問題1000!$A$1:$D$1001,2,FALSE)=\"\",\"\",\"P\"&VLOOKUP(N13,問題1000!$A$1:$D$1001,2,FALSE))","v":""},{"$f":"IF(VLOOKUP(O13,問題1000!$A$1:$D$1001,2,FALSE)=\"\",\"\",\"P\"&VLOOKUP(O13,問題1000!$A$1:$D$1001,2,FALSE))","v":"PP97"},{"$f":"IF(VLOOKUP(P13,問題1000!$A$1:$D$1001,2,FALSE)=\"\",\"\",\"P\"&VLOOKUP(P13,問題1000!$A$1:$D$1001,2,FALSE))","v":""},{"$f":"IF(VLOOKUP(Q13,問題1000!$A$1:$D$1001,2,FALSE)=\"\",\"\",\"P\"&VLOOKUP(Q13,問題1000!$A$1:$D$1001,2,FALSE))","v":""}]
[{"$f":"VLOOKUP(A13,問題1000!$A$1:$D$1001,4,FALSE)","v":"きのこいがいたべない"},{"$f":"VLOOKUP(B13,問題1000!$A$1:$D$1001,4,FALSE)","v":"いがいなけっか"},{"$f":"VLOOKUP(C13,問題1000!$A$1:$D$1001,4,FALSE)","v":"べいさく"},{"$f":"VLOOKUP(D13,問題1000!$A$1:$D$1001,4,FALSE)","v":"やさいのりょう"},{"$f":"VLOOKUP(E13,問題1000!$A$1:$D$1001,4,FALSE)","v":"かんしんをもつ"},{"$f":"VLOOKUP(F13,問題1000!$A$1:$D$1001,4,FALSE)","v":"かんしんなおこない"},{"$f":"VLOOKUP(G13,問題1000!$A$1:$D$1001,4,FALSE)","v":"しゅげいようひん"},{"$f":"VLOOKUP(H13,問題1000!$A$1:$D$1001,4,FALSE)","v":"じをなおす"},{"$f":"VLOOKUP(I13,問題1000!$A$1:$D$1001,4,FALSE)","v":"びょうきをなおす"},{"$f":"VLOOKUP(J13,問題1000!$A$1:$D$1001,4,FALSE)","v":"くべつ"},{"$f":"VLOOKUP(K13,問題1000!$A$1:$D$1001,4,FALSE)","v":"こうか"},{"$f":"VLOOKUP(L13,問題1000!$A$1:$D$1001,4,FALSE)","v":"しくみ"},{"$f":"VLOOKUP(M13,問題1000!$A$1:$D$1001,4,FALSE)","v":"ししょ"},{"$f":"VLOOKUP(N13,問題1000!$A$1:$D$1001,4,FALSE)","v":"さんこうとしょ"},{"$f":"VLOOKUP(O13,問題1000!$A$1:$D$1001,4,FALSE)","v":"ひゃっかじてん"},{"$f":"VLOOKUP(P13,問題1000!$A$1:$D$1001,4,FALSE)","v":"かにゅうする"},{"$f":"VLOOKUP(Q13,問題1000!$A$1:$D$1001,4,FALSE)","v":"へいわをねがう"}]
[{"$f":"B17+1","v":984},{"$f":"C17+1","v":983},{"$f":"D17+1","v":982},{"$f":"E17+1","v":981},{"$f":"F17+1","v":980},{"$f":"G17+1","v":979},{"$f":"H17+1","v":978},{"$f":"I17+1","v":977},{"$f":"J17+1","v":976},{"$f":"K17+1","v":975},{"$f":"L17+1","v":974},{"$f":"M17+1","v":973},{"$f":"N17+1","v":972},{"$f":"O17+1","v":971},{"$f":"P17+1","v":970},{"$f":"Q17+1","v":969},{"$f":"A13+1","v":968}]
[]
[{"$f":"IF(VLOOKUP(A17,問題1000!$A$1:$D$1001,2,FALSE)=\"\",\"\",\"P\"&VLOOKUP(A17,問題1000!$A$1:$D$1001,2,FALSE))","v":"PP117"},{"$f":"IF(VLOOKUP(B17,問題1000!$A$1:$D$1001,2,FALSE)=\"\",\"\",\"P\"&VLOOKUP(B17,問題1000!$A$1:$D$1001,2,FALSE))","v":"PP114"},{"$f":"IF(VLOOKUP(C17,問題1000!$A$1:$D$1001,2,FALSE)=\"\",\"\",\"P\"&VLOOKUP(C17,問題1000!$A$1:$D$1001,2,FALSE))","v":"PP113"},{"$f":"IF(VLOOKUP(D17,問題1000!$A$1:$D$1001,2,FALSE)=\"\",\"\",\"P\"&VLOOKUP(D17,問題1000!$A$1:$D$1001,2,FALSE))","v":""},{"$f":"IF(VLOOKUP(E17,問題1000!$A$1:$D$1001,2,FALSE)=\"\",\"\",\"P\"&VLOOKUP(E17,問題1000!$A$1:$D$1001,2,FALSE))","v":"PP112"},{"$f":"IF(VLOOKUP(F17,問題1000!$A$1:$D$1001,2,FALSE)=\"\",\"\",\"P\"&VLOOKUP(F17,問題1000!$A$1:$D$1001,2,FALSE))","v":"PP111"},{"$f":"IF(VLOOKUP(G17,問題1000!$A$1:$D$1001,2,FALSE)=\"\",\"\",\"P\"&VLOOKUP(G17,問題1000!$A$1:$D$1001,2,FALSE))","v":""},{"$f":"IF(VLOOKUP(H17,問題1000!$A$1:$D$1001,2,FALSE)=\"\",\"\",\"P\"&VLOOKUP(H17,問題1000!$A$1:$D$1001,2,FALSE))","v":"PP109"},{"$f":"IF(VLOOKUP(I17,問題1000!$A$1:$D$1001,2,FALSE)=\"\",\"\",\"P\"&VLOOKUP(I17,問題1000!$A$1:$D$1001,2,FALSE))","v":"PP108"},{"$f":"IF(VLOOKUP(J17,問題1000!$A$1:$D$1001,2,FALSE)=\"\",\"\",\"P\"&VLOOKUP(J17,問題1000!$A$1:$D$1001,2,FALSE))","v":""},{"$f":"IF(VLOOKUP(K17,問題1000!$A$1:$D$1001,2,FALSE)=\"\",\"\",\"P\"&VLOOKUP(K17,問題1000!$A$1:$D$1001,2,FALSE))","v":""},{"$f":"IF(VLOOKUP(L17,問題1000!$A$1:$D$1001,2,FALSE)=\"\",\"\",\"P\"&VLOOKUP(L17,問題1000!$A$1:$D$1001,2,FALSE))","v":""},{"$f":"IF(VLOOKUP(M17,問題1000!$A$1:$D$1001,2,FALSE)=\"\",\"\",\"P\"&VLOOKUP(M17,問題1000!$A$1:$D$1001,2,FALSE))","v":"PP106"},{"$f":"IF(VLOOKUP(N17,問題1000!$A$1:$D$1001,2,FALSE)=\"\",\"\",\"P\"&VLOOKUP(N17,問題1000!$A$1:$D$1001,2,FALSE))","v":""},{"$f":"IF(VLOOKUP(O17,問題1000!$A$1:$D$1001,2,FALSE)=\"\",\"\",\"P\"&VLOOKUP(O17,問題1000!$A$1:$D$1001,2,FALSE))","v":""},{"$f":"IF(VLOOKUP(P17,問題1000!$A$1:$D$1001,2,FALSE)=\"\",\"\",\"P\"&VLOOKUP(P17,問題1000!$A$1:$D$1001,2,FALSE))","v":"PP105"},{"$f":"IF(VLOOKUP(Q17,問題1000!$A$1:$D$1001,2,FALSE)=\"\",\"\",\"P\"&VLOOKUP(Q17,問題1000!$A$1:$D$1001,2,FALSE))","v":"PP104"}]
[{"$f":"VLOOKUP(A17,問題1000!$A$1:$D$1001,4,FALSE)","v":"いきをすう"},{"$f":"VLOOKUP(B17,問題1000!$A$1:$D$1001,4,FALSE)","v":"くさのたね"},{"$f":"VLOOKUP(C17,問題1000!$A$1:$D$1001,4,FALSE)","v":"ひろいあげる"},{"$f":"VLOOKUP(D17,問題1000!$A$1:$D$1001,4,FALSE)","v":"くさやね"},{"$f":"VLOOKUP(E17,問題1000!$A$1:$D$1001,4,FALSE)","v":"となえる"},{"$f":"VLOOKUP(F17,問題1000!$A$1:$D$1001,4,FALSE)","v":"おひさま"},{"$f":"VLOOKUP(G17,問題1000!$A$1:$D$1001,4,FALSE)","v":"めをみひらく"},{"$f":"VLOOKUP(H17,問題1000!$A$1:$D$1001,4,FALSE)","v":"はつゆきのふるひ"},{"$f":"VLOOKUP(I17,問題1000!$A$1:$D$1001,4,FALSE)","v":"せかいのはて"},{"$f":"VLOOKUP(J17,問題1000!$A$1:$D$1001,4,FALSE)","v":"つめたいかぜ"},{"$f":"VLOOKUP(K17,問題1000!$A$1:$D$1001,4,FALSE)","v":"こなゆきがまう"},{"$f":"VLOOKUP(L17,問題1000!$A$1:$D$1001,4,FALSE)","v":"みせばんをする"},{"$f":"VLOOKUP(M17,問題1000!$A$1:$D$1001,4,FALSE)","v":"ていりゅうじょ"},{"$f":"VLOOKUP(N17,問題1000!$A$1:$D$1001,4,FALSE)","v":"とびこむ"},{"$f":"VLOOKUP(O17,問題1000!$A$1:$D$1001,4,FALSE)","v":"かるくてころがる"},{"$f":"VLOOKUP(P17,問題1000!$A$1:$D$1001,4,FALSE)","v":"まんまる"},{"$f":"VLOOKUP(Q17,問題1000!$A$1:$D$1001,4,FALSE)","v":"いっぽんみち"}]
[null,{"$f":"C21+1","v":1000},{"$f":"D21+1","v":999},{"$f":"E21+1","v":998},{"$f":"F21+1","v":997},{"$f":"G21+1","v":996},{"$f":"H21+1","v":995},{"$f":"I21+1","v":994},{"$f":"J21+1","v":993},{"$f":"K21+1","v":992},{"$f":"L21+1","v":991},{"$f":"M21+1","v":990},{"$f":"N21+1","v":989},{"$f":"O21+1","v":988},{"$f":"P21+1","v":987},{"$f":"Q21+1","v":986},{"$f":"A17+1","v":985}]
[]
[null,{"$f":"IF(VLOOKUP(B21,問題1000!$A$1:$D$1001,2,FALSE)=\"\",\"\",\"P\"&VLOOKUP(B21,問題1000!$A$1:$D$1001,2,FALSE))","v":""},{"$f":"IF(VLOOKUP(C21,問題1000!$A$1:$D$1001,2,FALSE)=\"\",\"\",\"P\"&VLOOKUP(C21,問題1000!$A$1:$D$1001,2,FALSE))","v":""},{"$f":"IF(VLOOKUP(D21,問題1000!$A$1:$D$1001,2,FALSE)=\"\",\"\",\"P\"&VLOOKUP(D21,問題1000!$A$1:$D$1001,2,FALSE))","v":""},{"$f":"IF(VLOOKUP(E21,問題1000!$A$1:$D$1001,2,FALSE)=\"\",\"\",\"P\"&VLOOKUP(E21,問題1000!$A$1:$D$1001,2,FALSE))","v":"PP129"},{"$f":"IF(VLOOKUP(F21,問題1000!$A$1:$D$1001,2,FALSE)=\"\",\"\",\"P\"&VLOOKUP(F21,問題1000!$A$1:$D$1001,2,FALSE))","v":""},{"$f":"IF(VLOOKUP(G21,問題1000!$A$1:$D$1001,2,FALSE)=\"\",\"\",\"P\"&VLOOKUP(G21,問題1000!$A$1:$D$1001,2,FALSE))","v":""},{"$f":"IF(VLOOKUP(H21,問題1000!$A$1:$D$1001,2,FALSE)=\"\",\"\",\"P\"&VLOOKUP(H21,問題1000!$A$1:$D$1001,2,FALSE))","v":"PP128"},{"$f":"IF(VLOOKUP(I21,問題1000!$A$1:$D$1001,2,FALSE)=\"\",\"\",\"P\"&VLOOKUP(I21,問題1000!$A$1:$D$1001,2,FALSE))","v":"PP127"},{"$f":"IF(VLOOKUP(J21,問題1000!$A$1:$D$1001,2,FALSE)=\"\",\"\",\"P\"&VLOOKUP(J21,問題1000!$A$1:$D$1001,2,FALSE))","v":"PP124"},{"$f":"IF(VLOOKUP(K21,問題1000!$A$1:$D$1001,2,FALSE)=\"\",\"\",\"P\"&VLOOKUP(K21,問題1000!$A$1:$D$1001,2,FALSE))","v":""},{"$f":"IF(VLOOKUP(L21,問題1000!$A$1:$D$1001,2,FALSE)=\"\",\"\",\"P\"&VLOOKUP(L21,問題1000!$A$1:$D$1001,2,FALSE))","v":""},{"$f":"IF(VLOOKUP(M21,問題1000!$A$1:$D$1001,2,FALSE)=\"\",\"\",\"P\"&VLOOKUP(M21,問題1000!$A$1:$D$1001,2,FALSE))","v":""},{"$f":"IF(VLOOKUP(N21,問題1000!$A$1:$D$1001,2,FALSE)=\"\",\"\",\"P\"&VLOOKUP(N21,問題1000!$A$1:$D$1001,2,FALSE))","v":""},{"$f":"IF(VLOOKUP(O21,問題1000!$A$1:$D$1001,2,FALSE)=\"\",\"\",\"P\"&VLOOKUP(O21,問題1000!$A$1:$D$1001,2,FALSE))","v":"PP123"},{"$f":"IF(VLOOKUP(P21,問題1000!$A$1:$D$1001,2,FALSE)=\"\",\"\",\"P\"&VLOOKUP(P21,問題1000!$A$1:$D$1001,2,FALSE))","v":""},{"$f":"IF(VLOOKUP(Q21,問題1000!$A$1:$D$1001,2,FALSE)=\"\",\"\",\"P\"&VLOOKUP(Q21,問題1000!$A$1:$D$1001,2,FALSE))","v":"PP118"}]
[null,{"$f":"VLOOKUP(B21,問題1000!$A$1:$D$1001,4,FALSE)","v":"みつむらとしょ"},{"$f":"VLOOKUP(C21,問題1000!$A$1:$D$1001,4,FALSE)","v":"こくご"},{"$f":"VLOOKUP(D21,問題1000!$A$1:$D$1001,4,FALSE)","v":"みじかくする"},{"$f":"VLOOKUP(E21,問題1000!$A$1:$D$1001,4,FALSE)","v":"いんしょうづける"},{"$f":"VLOOKUP(F21,問題1000!$A$1:$D$1001,4,FALSE)","v":"ぶんしょうのしゅるい"},{"$f":"VLOOKUP(G21,問題1000!$A$1:$D$1001,4,FALSE)","v":"とうじょうじんぶつ"},{"$f":"VLOOKUP(H21,問題1000!$A$1:$D$1001,4,FALSE)","v":"じゅうようなことば"},{"$f":"VLOOKUP(I21,問題1000!$A$1:$D$1001,4,FALSE)","v":"ずひょうをつかう"},{"$f":"VLOOKUP(J21,問題1000!$A$1:$D$1001,4,FALSE)","v":"ひこうき"},{"$f":"VLOOKUP(K21,問題1000!$A$1:$D$1001,4,FALSE)","v":"ひっし"},{"$f":"VLOOKUP(L21,問題1000!$A$1:$D$1001,4,FALSE)","v":"こくさいこうりゅう"},{"$f":"VLOOKUP(M21,問題1000!$A$1:$D$1001,4,FALSE)","v":"たこうせい"},{"$f":"VLOOKUP(N21,問題1000!$A$1:$D$1001,4,FALSE)","v":"もうひつ"},{"$f":"VLOOKUP(O21,問題1000!$A$1:$D$1001,4,FALSE)","v":"しんきゅう"},{"$f":"VLOOKUP(P21,問題1000!$A$1:$D$1001,4,FALSE)","v":"とりかこむ"},{"$f":"VLOOKUP(Q21,問題1000!$A$1:$D$1001,4,FALSE)","v":"しょくどう"}]

{"sheet":"Sheet3","index":2,"n_rows":0,"n_cols":0,"rows_kept":0,"cut":false,"hidden":false,"merged":[]}